{"text_format":"1","workbook":"xlsx","n_sheets":12,"sheets":["Cover","Introduction","Front sheet","Lancashire estimates","2014-15 Prevalence Estimates","2014-15 Prev Estimates by Age","OCU","Opiate","Crack","OCU by Age","Opiate by Age","Opiate by Gender"],"not_rendered":{"charts":0,"images":1,"macros":0,"external_links":0,"defined_names":24,"comments":0,"pivot_tables":0},"unopened":[],"bounds":{"document_bytes":16777216,"sheet_cells":100000,"rows_first":2000,"rows_last":500,"rows_between":2000,"halvings":0,"cell_chars":16384,"cell_head_chars":4096},"cells_cut":0,"cells_raw":0,"read":"whole","date_system":"1900"}

{"sheet":"Cover","index":0,"n_rows":25,"n_cols":3,"rows_kept":25,"cut":false,"hidden":false,"merged":[[0,0,0,8],[23,2,23,7],[24,2,24,7],[25,2,25,7],[22,1,22,7],[8,1,8,8],[14,1,14,8],[15,1,15,8],[16,1,16,8],[11,1,11,8]]}
[]
[]
[]
[]
[]
[]
[]
[]
[null,"Estimates of the prevalence of opiate use and/or crack cocaine use (2014/15) "]
[]
[]
[null,"September 2017"]
[]
[]
[null,"Gordon Hay1,2"]
[null,"Anderson Rael dos Santos2"]
[]
[]
[]
[]
[]
[]
[]
[null,1,"Centre for Public Health, Liverpool John Moores University"]
[null,2,"Glasgow Prevalence Estimation Limited"]

{"sheet":"Introduction","index":1,"n_rows":33,"n_cols":3,"rows_kept":33,"cut":false,"hidden":false,"merged":[[21,2,21,9],[19,1,19,9],[0,1,0,9],[2,1,2,9],[14,2,14,9],[15,2,15,9],[32,1,32,9],[29,1,29,9],[18,1,18,9],[4,1,4,9],[6,1,6,9],[8,2,8,9],[9,2,9,9],[10,2,10,9],[11,2,11,9],[12,2,12,9],[13,2,13,9],[27,1,27,9],[25,1,25,9],[23,1,23,9],[17,1,17,9],[20,2,20,9]]}
[null,"Introduction"]
[]
[null,"This report presents opiate and / or crack use (OCU) prevalence estimates for local authority areas across England, based on data relating  to the financial year 1 April 2014 to 31 March 2015. This report also refers to the prevalence estimates of previous periods, for 2011/12 and 2010/11."]
[]
[null,"‘OCU’ refers to use of opiates and/or crack cocaine.  It does not include the use of cocaine in a powder form, amphetamine, ecstasy or cannabis.  Although many opiate and/or crack users also use these drugs it is very difficult to identify exclusive users of these drugs from the available data sources."]
[]
[null,"All tables contain the estimates for the 2014/15 year along with their associated confidence intervals. The report contains the following information;"]
[]
[null,">","2014-15 Prevalence estimates"]
[null,">","2014-15 Prevalence estimates by Age"]
[null,">","OCU"]
[null,">","Opiate"]
[null,">","Crack"]
[null,">","OCU by age"]
[null,">","Opiate by age"]
[null,">","Opiate by gender"]
[]
[null,"These tables show the estimated total number and prevalence rate at local authority, regional and national levels.  All prevalence rates stated show the number of OCUs in that local authority area per thousand people in the population.  It is advisable to look at the prevalence rate as well as the actual numbers, because any significant changes in the number of OCUs may simply reflect fluctuations in the general population for that area. The age range employed within the study is from 15 to 64 and where the estimates have been stratified by age group, these are from 15 to 24, from 25 to 34, and from 35 to 64."]
[null,"The OCU table shows the estimate total number at a local authority, regional and national level. This is followed by separate tables for each type of OCU – opiate users and crack cocaine users.  There are some additional OCU and Opiate tables that show problem drug use by each of three age groups ; 15 to 24, from 25 to 34, and from 35 to 64. Each of these tables also contain the following information;"]
[]
[null,"a)","The difference between 2014/15 and 2011/12 estimates and the confidence intervals around it."]
[null,"b)","Whether this difference represents a statistically significant change at the 95% level – indicated by * followed by an arrow describing the direction of the change (i.e. ↑ for an increase, ↓ for a decrease)."]
[]
[null,"Please note: \nIt must be stressed that these figures are estimates.  They should always be interpreted in conjunction with their associated confidence intervals, which are specified in each table.  The confidence intervals show the range within which there is a 95% certainty that the true value exists, though it is most likely to lie near the estimate itself.  For a full description of the study’s methodology please refer to the full report of the first sweep[1]."]
[]
[null,"Where significant changes have been marked, this should be interpreted as indicative of some possible change rather than as evidence of a definite change.  For the same reasons caution should be used when making inferences from comparisons between areas.  The estimates are designed to be used in conjunction with local knowledge as a guide to service planning."]
[]
[null,"Separate tables for estimated total number and for prevalence rate are shown from each case.  All prevalence rates stated show the number of OCUs in that local authority area per thousand people in the population.  It is advisable to look at the prevalence rate as well as the actual numbers, because any significant changes in the number of OCUs may simply reflect fluctuations in the general population for that area."]
[]
[null,"Notes on Table Headings\nOCU – Opiate and/or crack cocaine use.\nPrevalence Rate – Rate per thousand population aged 15 to 64 (or in the relevant age group)\nSig 95% - Whether or not the difference since the 2011/12 sweep is statistically significant at the 95% level.\n*↑/*↓ - Whether a significant change shows an increase or a decrease."]
[]
[null,"Reference"]
[null,"[1] Hay, G., Gannon, M., MacDougall, J., Millar, T., Eastwood, C. and McKeganey, N. (2006) Local and national estimates of the prevalence of opiate use and/or crack cocaine use (2004/05).  In Singleton, N., Murray, R. and Tinsley, L. (Eds.) Measuring different aspects of problem drug use: methodological developments.  Online Report OLR 16/06. London. Home Office."]

{"sheet":"Front sheet","index":2,"n_rows":249,"n_cols":14,"rows_kept":249,"cut":false,"hidden":false,"merged":[[5,2,5,8],[7,2,7,9],[9,2,9,9],[23,2,23,13],[11,2,11,10],[17,2,17,10],[19,11,19,12],[20,11,20,12],[21,11,21,12],[17,11,18,12]]}
[]
[]
[]
[]
[]
[null,null,"Prevalence Estimates 2014/15"]
[]
[null,null,"Please select partnership"]
[]
[null,null,{"$f":"VLOOKUP(C8,B96:C249,2,0)","v":" "}]
[]
[null,null,"Number of users"]
[null,null,"OCU","Lower bound  95% CI","Upper bound  95% CI","Opiate users","Lower bound  95% CI","Upper bound   95% CI","Crack users","Lower bound  95% CI","Upper bound  95% CI"]
[null,{"$f":"C8","v":"Please select partnership"},{"$f":"IF(ISERROR(VLOOKUP($B14,'2014-15 Prevalence Estimates'!$B$7:$U$169,3,0)),\"\",VLOOKUP($B14,'2014-15 Prevalence Estimates'!$B$7:$U$169,3,0))","v":""},{"$f":"IF(ISERROR(VLOOKUP($B14,'2014-15 Prevalence Estimates'!$B$7:$U$169,4,0)),\"\",VLOOKUP($B14,'2014-15 Prevalence Estimates'!$B$7:$U$169,4,0))","v":""},{"$f":"IF(ISERROR(VLOOKUP($B14,'2014-15 Prevalence Estimates'!$B$7:$U$169,5,0)),\"\",VLOOKUP($B14,'2014-15 Prevalence Estimates'!$B$7:$U$169,5,0))","v":""},{"$f":"IF(ISERROR(VLOOKUP($B14,'2014-15 Prevalence Estimates'!$B$7:$U$169,6,0)),\"\",VLOOKUP($B14,'2014-15 Prevalence Estimates'!$B$7:$U$169,6,0))","v":""},{"$f":"IF(ISERROR(VLOOKUP($B14,'2014-15 Prevalence Estimates'!$B$7:$U$169,7,0)),\"\",VLOOKUP($B14,'2014-15 Prevalence Estimates'!$B$7:$U$169,7,0))","v":""},{"$f":"IF(ISERROR(VLOOKUP($B14,'2014-15 Prevalence Estimates'!$B$7:$U$169,8,0)),\"\",VLOOKUP($B14,'2014-15 Prevalence Estimates'!$B$7:$U$169,8,0))","v":""},{"$f":"IF(ISERROR(VLOOKUP($B14,'2014-15 Prevalence Estimates'!$B$7:$U$169,9,0)),\"\",VLOOKUP($B14,'2014-15 Prevalence Estimates'!$B$7:$U$169,9,0))","v":""},{"$f":"IF(ISERROR(VLOOKUP($B14,'2014-15 Prevalence Estimates'!$B$7:$U$169,10,0)),\"\",VLOOKUP($B14,'2014-15 Prevalence Estimates'!$B$7:$U$169,10,0))","v":""},{"$f":"IF(ISERROR(VLOOKUP($B14,'2014-15 Prevalence Estimates'!$B$7:$U$169,11,0)),\"\",VLOOKUP($B14,'2014-15 Prevalence Estimates'!$B$7:$U$169,11,0))","v":""}]
[null,{"$f":"C10","v":" "},{"$f":"IF(ISERROR(VLOOKUP($B15,'2014-15 Prevalence Estimates'!$B$7:$U$169,3,0)),\"\",VLOOKUP($B15,'2014-15 Prevalence Estimates'!$B$7:$U$169,3,0))","v":""},{"$f":"IF(ISERROR(VLOOKUP($B15,'2014-15 Prevalence Estimates'!$B$7:$U$169,4,0)),\"\",VLOOKUP($B15,'2014-15 Prevalence Estimates'!$B$7:$U$169,4,0))","v":""},{"$f":"IF(ISERROR(VLOOKUP($B15,'2014-15 Prevalence Estimates'!$B$7:$U$169,5,0)),\"\",VLOOKUP($B15,'2014-15 Prevalence Estimates'!$B$7:$U$169,5,0))","v":""},{"$f":"IF(ISERROR(VLOOKUP($B15,'2014-15 Prevalence Estimates'!$B$7:$U$169,6,0)),\"\",VLOOKUP($B15,'2014-15 Prevalence Estimates'!$B$7:$U$169,6,0))","v":""},{"$f":"IF(ISERROR(VLOOKUP($B15,'2014-15 Prevalence Estimates'!$B$7:$U$169,7,0)),\"\",VLOOKUP($B15,'2014-15 Prevalence Estimates'!$B$7:$U$169,7,0))","v":""},{"$f":"IF(ISERROR(VLOOKUP($B15,'2014-15 Prevalence Estimates'!$B$7:$U$169,8,0)),\"\",VLOOKUP($B15,'2014-15 Prevalence Estimates'!$B$7:$U$169,8,0))","v":""},{"$f":"IF(ISERROR(VLOOKUP($B15,'2014-15 Prevalence Estimates'!$B$7:$U$169,9,0)),\"\",VLOOKUP($B15,'2014-15 Prevalence Estimates'!$B$7:$U$169,9,0))","v":""},{"$f":"IF(ISERROR(VLOOKUP($B15,'2014-15 Prevalence Estimates'!$B$7:$U$169,10,0)),\"\",VLOOKUP($B15,'2014-15 Prevalence Estimates'!$B$7:$U$169,10,0))","v":""},{"$f":"IF(ISERROR(VLOOKUP($B15,'2014-15 Prevalence Estimates'!$B$7:$U$169,11,0)),\"\",VLOOKUP($B15,'2014-15 Prevalence Estimates'!$B$7:$U$169,11,0))","v":""}]
[null,"England",{"$f":"'2014-15 Prevalence Estimates'!D169","v":300783},{"$f":"'2014-15 Prevalence Estimates'!E169","v":297986},{"$f":"'2014-15 Prevalence Estimates'!F169","v":311128},{"$f":"'2014-15 Prevalence Estimates'!G169","v":257476},{"$f":"'2014-15 Prevalence Estimates'!H169","v":255440},{"$f":"'2014-15 Prevalence Estimates'!I169","v":266643},{"$f":"'2014-15 Prevalence Estimates'!J169","v":182828},{"$f":"'2014-15 Prevalence Estimates'!K169","v":176675},{"$f":"'2014-15 Prevalence Estimates'!L169","v":190782}]
[]
[null,null,"Rate per thousand of the population",null,null,null,null,null,null,null,null,"15-64 population"]
[null,null,"OCU","Lower bound  95% CI","Upper bound  95% CI","Opiate users","Lower bound  95% CI","Upper bound   95% CI","Crack users","Lower bound  95% CI","Upper bound  95% CI"]
[null,{"$f":"C8","v":"Please select partnership"},{"$f":"IF(ISERROR(VLOOKUP($B20,'2014-15 Prevalence Estimates'!$B$7:$U$169,12,0)),\"\",VLOOKUP($B20,'2014-15 Prevalence Estimates'!$B$7:$U$169,12,0))","v":""},{"$f":"IF(ISERROR(VLOOKUP($B20,'2014-15 Prevalence Estimates'!$B$7:$U$169,13,0)),\"\",VLOOKUP($B20,'2014-15 Prevalence Estimates'!$B$7:$U$169,13,0))","v":""},{"$f":"IF(ISERROR(VLOOKUP($B20,'2014-15 Prevalence Estimates'!$B$7:$U$169,14,0)),\"\",VLOOKUP($B20,'2014-15 Prevalence Estimates'!$B$7:$U$169,14,0))","v":""},{"$f":"IF(ISERROR(VLOOKUP($B20,'2014-15 Prevalence Estimates'!$B$7:$U$169,15,0)),\"\",VLOOKUP($B20,'2014-15 Prevalence Estimates'!$B$7:$U$169,15,0))","v":""},{"$f":"IF(ISERROR(VLOOKUP($B20,'2014-15 Prevalence Estimates'!$B$7:$U$169,16,0)),\"\",VLOOKUP($B20,'2014-15 Prevalence Estimates'!$B$7:$U$169,16,0))","v":""},{"$f":"IF(ISERROR(VLOOKUP($B20,'2014-15 Prevalence Estimates'!$B$7:$U$169,17,0)),\"\",VLOOKUP($B20,'2014-15 Prevalence Estimates'!$B$7:$U$169,17,0))","v":""},{"$f":"IF(ISERROR(VLOOKUP($B20,'2014-15 Prevalence Estimates'!$B$7:$U$169,18,0)),\"\",VLOOKUP($B20,'2014-15 Prevalence Estimates'!$B$7:$U$169,18,0))","v":""},{"$f":"IF(ISERROR(VLOOKUP($B20,'2014-15 Prevalence Estimates'!$B$7:$U$169,19,0)),\"\",VLOOKUP($B20,'2014-15 Prevalence Estimates'!$B$7:$U$169,19,0))","v":""},{"$f":"IF(ISERROR(VLOOKUP($B20,'2014-15 Prevalence Estimates'!$B$7:$U$169,20,0)),\"\",VLOOKUP($B20,'2014-15 Prevalence Estimates'!$B$7:$U$169,20,0))","v":""},{"$f":"IF(ISERROR(VLOOKUP($B20,'2014-15 Prevalence Estimates'!$B$7:$U$169,2,0)),\"\",VLOOKUP($B20,'2014-15 Prevalence Estimates'!$B$7:$U$169,2,0))","v":""}]
[null,{"$f":"C10","v":" "},{"$f":"IF(ISERROR(VLOOKUP($B21,'2014-15 Prevalence Estimates'!$B$7:$U$169,12,0)),\"\",VLOOKUP($B21,'2014-15 Prevalence Estimates'!$B$7:$U$169,12,0))","v":""},{"$f":"IF(ISERROR(VLOOKUP($B21,'2014-15 Prevalence Estimates'!$B$7:$U$169,13,0)),\"\",VLOOKUP($B21,'2014-15 Prevalence Estimates'!$B$7:$U$169,13,0))","v":""},{"$f":"IF(ISERROR(VLOOKUP($B21,'2014-15 Prevalence Estimates'!$B$7:$U$169,14,0)),\"\",VLOOKUP($B21,'2014-15 Prevalence Estimates'!$B$7:$U$169,14,0))","v":""},{"$f":"IF(ISERROR(VLOOKUP($B21,'2014-15 Prevalence Estimates'!$B$7:$U$169,15,0)),\"\",VLOOKUP($B21,'2014-15 Prevalence Estimates'!$B$7:$U$169,15,0))","v":""},{"$f":"IF(ISERROR(VLOOKUP($B21,'2014-15 Prevalence Estimates'!$B$7:$U$169,16,0)),\"\",VLOOKUP($B21,'2014-15 Prevalence Estimates'!$B$7:$U$169,16,0))","v":""},{"$f":"IF(ISERROR(VLOOKUP($B21,'2014-15 Prevalence Estimates'!$B$7:$U$169,17,0)),\"\",VLOOKUP($B21,'2014-15 Prevalence Estimates'!$B$7:$U$169,17,0))","v":""},{"$f":"IF(ISERROR(VLOOKUP($B21,'2014-15 Prevalence Estimates'!$B$7:$U$169,18,0)),\"\",VLOOKUP($B21,'2014-15 Prevalence Estimates'!$B$7:$U$169,18,0))","v":""},{"$f":"IF(ISERROR(VLOOKUP($B21,'2014-15 Prevalence Estimates'!$B$7:$U$169,19,0)),\"\",VLOOKUP($B21,'2014-15 Prevalence Estimates'!$B$7:$U$169,19,0))","v":""},{"$f":"IF(ISERROR(VLOOKUP($B21,'2014-15 Prevalence Estimates'!$B$7:$U$169,20,0)),\"\",VLOOKUP($B21,'2014-15 Prevalence Estimates'!$B$7:$U$169,20,0))","v":""},{"$f":"IF(ISERROR(VLOOKUP($B21,'2014-15 Prevalence Estimates'!$B$7:$U$169,2,0)),\"\",VLOOKUP($B21,'2014-15 Prevalence Estimates'!$B$7:$U$169,2,0))","v":""}]
[null,"England",{"$f":"'2014-15 Prevalence Estimates'!M169","v":8.5686978771588933},{"$f":"'2014-15 Prevalence Estimates'!N169","v":8.4890170176608049},{"$f":"'2014-15 Prevalence Estimates'!O169","v":8.8634059542084902},{"$f":"'2014-15 Prevalence Estimates'!P169","v":7.334969245666688},{"$f":"'2014-15 Prevalence Estimates'!Q169","v":7.2769677333541711},{"$f":"'2014-15 Prevalence Estimates'!R169","v":7.5961184909362522},{"$f":"'2014-15 Prevalence Estimates'!S169","v":5.208399063395226},{"$f":"'2014-15 Prevalence Estimates'!T169","v":5.0331125676884909},{"$f":"'2014-15 Prevalence Estimates'!U169","v":5.4349923978420591},{"$f":"'2014-15 Prevalence Estimates'!C169","v":35102533}]
[]
[null,null,"Difference between 2014/15 and 2011/12 prevalence estimates"]
[null,null,"OCU Difference ","Lower bound  95% CI","Upper bound  95% CI","Significant Change","Opiate Difference","Lower bound  95% CI","Upper bound   95% CI","Significant Change","Crack Difference","Lower bound  95% CI","Upper bound  95% CI","Significant Change"]
[null,{"$f":"C8","v":"Please select partnership"},{"$f":"IF(ISERROR(VLOOKUP($B26,OCU!$B$7:$O$165,11,0)),\"\",VLOOKUP($B26,OCU!$B$7:$O$165,11,0))","v":""},{"$f":"IF(ISERROR(VLOOKUP($B26,OCU!$B$7:$O$165,12,0)),\"\",VLOOKUP($B26,OCU!$B$7:$O$165,12,0))","v":""},{"$f":"IF(ISERROR(VLOOKUP($B26,OCU!$B$7:$O$165,13,0)),\"\",VLOOKUP($B26,OCU!$B$7:$O$165,13,0))","v":""},{"$f":"IF(ISERROR(VLOOKUP($B26,OCU!$B$7:$O$165,14,0)),\"\",VLOOKUP($B26,OCU!$B$7:$O$165,14,0))","v":""},{"$f":"IF(ISERROR(VLOOKUP($B26,Opiate!$B$4:$O$165,11,0)),\"\",VLOOKUP($B26,Opiate!$B$4:$O$165,11,0))","v":""},{"$f":"IF(ISERROR(VLOOKUP($B26,Opiate!$B$4:$O$165,12,0)),\"\",VLOOKUP($B26,Opiate!$B$4:$O$165,12,0))","v":""},{"$f":"IF(ISERROR(VLOOKUP($B26,Opiate!$B$4:$O$165,13,0)),\"\",VLOOKUP($B26,Opiate!$B$4:$O$165,13,0))","v":""},{"$f":"IF(ISERROR(VLOOKUP($B26,Opiate!$B$4:$O$165,14,0)),\"\",VLOOKUP($B26,Opiate!$B$4:$O$165,14,0))","v":""},{"$f":"IF(ISERROR(VLOOKUP($B26,Crack!$B$4:$O$165,11,0)),\"\",VLOOKUP($B26,Crack!$B$4:$O$165,11,0))","v":""},{"$f":"IF(ISERROR(VLOOKUP($B26,Crack!$B$4:$O$165,12,0)),\"\",VLOOKUP($B26,Crack!$B$4:$O$165,12,0))","v":""},{"$f":"IF(ISERROR(VLOOKUP($B26,Crack!$B$4:$O$165,13,0)),\"\",VLOOKUP($B26,Crack!$B$4:$O$165,13,0))","v":""},{"$f":"IF(ISERROR(VLOOKUP($B26,Crack!$B$4:$O$165,14,0)),\"\",VLOOKUP($B26,Crack!$B$4:$O$165,14,0))","v":""}]
[null,{"$f":"C10","v":" "},{"$f":"IF(ISERROR(VLOOKUP($B27,OCU!$B$7:$O$165,11,0)),\"\",VLOOKUP($B27,OCU!$B$7:$O$165,11,0))","v":""},{"$f":"IF(ISERROR(VLOOKUP($B27,OCU!$B$7:$O$165,12,0)),\"\",VLOOKUP($B27,OCU!$B$7:$O$165,12,0))","v":""},{"$f":"IF(ISERROR(VLOOKUP($B27,OCU!$B$7:$O$165,13,0)),\"\",VLOOKUP($B27,OCU!$B$7:$O$165,13,0))","v":""},{"$f":"IF(ISERROR(VLOOKUP($B27,OCU!$B$7:$O$165,14,0)),\"\",VLOOKUP($B27,OCU!$B$7:$O$165,14,0))","v":""},{"$f":"IF(ISERROR(VLOOKUP($B27,Opiate!$B$4:$O$165,11,0)),\"\",VLOOKUP($B27,Opiate!$B$4:$O$165,11,0))","v":""},{"$f":"IF(ISERROR(VLOOKUP($B27,Opiate!$B$4:$O$165,12,0)),\"\",VLOOKUP($B27,Opiate!$B$4:$O$165,12,0))","v":""},{"$f":"IF(ISERROR(VLOOKUP($B27,Opiate!$B$4:$O$165,13,0)),\"\",VLOOKUP($B27,Opiate!$B$4:$O$165,13,0))","v":""},{"$f":"IF(ISERROR(VLOOKUP($B27,Opiate!$B$4:$O$165,14,0)),\"\",VLOOKUP($B27,Opiate!$B$4:$O$165,14,0))","v":""},{"$f":"IF(ISERROR(VLOOKUP($B27,Crack!$B$4:$O$165,11,0)),\"\",VLOOKUP($B27,Crack!$B$4:$O$165,11,0))","v":""},{"$f":"IF(ISERROR(VLOOKUP($B27,Crack!$B$4:$O$165,12,0)),\"\",VLOOKUP($B27,Crack!$B$4:$O$165,12,0))","v":""},{"$f":"IF(ISERROR(VLOOKUP($B27,Crack!$B$4:$O$165,13,0)),\"\",VLOOKUP($B27,Crack!$B$4:$O$165,13,0))","v":""},{"$f":"IF(ISERROR(VLOOKUP($B27,Crack!$B$4:$O$165,14,0)),\"\",VLOOKUP($B27,Crack!$B$4:$O$165,14,0))","v":""}]
[null,"England",{"$f":"OCU!L165","v":6904},{"$f":"OCU!M165","v":-593},{"$f":"OCU!N165","v":16618},null,{"$f":"Opiate!L165","v":1313.1772907543636},{"$f":"Opiate!M165","v":-5134},{"$f":"Opiate!N165","v":9419},null,{"$f":"Crack!L165","v":16188},{"$f":"Crack!M165","v":6635},{"$f":"Crack!N165","v":25832},{"$f":"Crack!O165","v":"*↑"}]
[]
[]
[]
[]
[]
[]
[]
[]
[]
[]
[]
[]
[]
[]
[]
[]
[]
[]
[]
[]
[]
[]
[]
[]
[]
[]
[]
[]
[]
[]
[]
[]
[]
[]
[]
[]
[]
[]
[]
[]
[]
[]
[]
[]
[]
[]
[]
[]
[]
[]
[]
[]
[]
[]
[]
[]
[]
[]
[]
[]
[]
[]
[]
[]
[]
[]
[]
[null,"Please select partnership"," "]
[null,"Barking and Dagenham","London"]
[null,"Barnet","London"]
[null,"Barnsley","Yorkshire and the Humber"]
[null,"Bath and North East Somerset","South West"]
[null,"Bedfordshire \n(Bedford UA/Central Bedfordshire UA)","East of England"]
[null,"Bedford","East of England"]
[null,"Central Bedfordshire","East of England"]
[null,"Bexley","London"]
[null,"Birmingham","West Midlands"]
[null,"Blackburn with Darwen","North West"]
[null,"Blackpool","North West"]
[null,"Bolton","North West"]
[null,"Bournemouth","South West"]
[null,"Bracknell Forest","South East"]
[null,"Bradford","Yorkshire and the Humber"]
[null,"Brent","London"]
[null,"Brighton and Hove","South East"]
[null,"Bristol, City of","South West"]
[null,"Bromley","London"]
[null,"Buckinghamshire","South East"]
[null,"Bury","North West"]
[null,"Calderdale","Yorkshire and the Humber"]
[null,"Cambridgeshire","East of England"]
[null,"Camden","London"]
[null,"Cheshire \n(Cheshire West, Cheshire East and Cheshire UA)","North West"]
[null,"Cheshire East","North West"]
[null,"Cheshire West and Chester","North West"]
[null,"City of London","London"]
[null,"Cornwall (UA) and \nIsles of Scilly (UA)","South West"]
[null,"County Durham","North East"]
[null,"Coventry","West Midlands"]
[null,"Croydon","London"]
[null,"Cumbria","North West"]
[null,"Darlington","North East"]
[null,"Derby","East Midlands"]
[null,"Derbyshire","East Midlands"]
[null,"Devon","South West"]
[null,"Doncaster","Yorkshire and the Humber"]
[null,"Dorset","South West"]
[null,"Dudley","West Midlands"]
[null,"Ealing","London"]
[null,"East Riding of Yorkshire","Yorkshire and the Humber"]
[null,"East Sussex","South East"]
[null,"Enfield","London"]
[null,"Essex","East of England"]
[null,"Gateshead","North East"]
[null,"Gloucestershire","South West"]
[null,"Greenwich","London"]
[null,"Hackney","London"]
[null,"Halton","North West"]
[null,"Hammersmith and Fulham","London"]
[null,"Hampshire","South East"]
[null,"Haringey","London"]
[null,"Harrow","London"]
[null,"Hartlepool","North East"]
[null,"Havering","London"]
[null,"Herefordshire, County of","West Midlands"]
[null,"Hertfordshire","East of England"]
[null,"Hillingdon","London"]
[null,"Hounslow","London"]
[null,"Isle of Wight","South East"]
[null,"Islington","London"]
[null,"Kensington and Chelsea","London"]
[null,"Kent","South East"]
[null,"Kingston upon Hull, City of","Yorkshire and the Humber"]
[null,"Kingston upon Thames","London"]
[null,"Kirklees","Yorkshire and the Humber"]
[null,"Knowsley","North West"]
[null,"Lambeth","London"]
[null,"Lancashire","North West"]
[null,"Leeds","Yorkshire and the Humber"]
[null,"Leicester","East Midlands"]
[null,"Leicestershire","East Midlands"]
[null,"Lewisham","London"]
[null,"Lincolnshire","East Midlands"]
[null,"Liverpool","North West"]
[null,"Luton","East of England"]
[null,"Manchester","North West"]
[null,"Medway","South East"]
[null,"Merton","London"]
[null,"Middlesbrough","North East"]
[null,"Milton Keynes","South East"]
[null,"Newcastle upon Tyne","North East"]
[null,"Newham","London"]
[null,"Norfolk","East of England"]
[null,"North East Lincolnshire","Yorkshire and the Humber"]
[null,"North Lincolnshire","Yorkshire and the Humber"]
[null,"North Somerset","South West"]
[null,"North Tyneside","North East"]
[null,"North Yorkshire","Yorkshire and the Humber"]
[null,"Northamptonshire","East Midlands"]
[null,"Northumberland","North East"]
[null,"Nottingham","East Midlands"]
[null,"Nottinghamshire","East Midlands"]
[null,"Oldham","North West"]
[null,"Oxfordshire","South East"]
[null,"Peterborough","East of England"]
[null,"Plymouth","South West"]
[null,"Poole","South West"]
[null,"Portsmouth","South East"]
[null,"Reading","South East"]
[null,"Redbridge","London"]
[null,"Redcar and Cleveland","North East"]
[null,"Richmond upon Thames","London"]
[null,"Rochdale","North West"]
[null,"Rotherham","Yorkshire and the Humber"]
[null,"Rutland","East Midlands"]
[null,"Salford","North West"]
[null,"Sandwell","West Midlands"]
[null,"Sefton","North West"]
[null,"Sheffield","Yorkshire and the Humber"]
[null,"Shropshire","West Midlands"]
[null,"Slough","South East"]
[null,"Solihull","West Midlands"]
[null,"Somerset","South West"]
[null,"South Gloucestershire","South West"]
[null,"South Tyneside","North East"]
[null,"Southampton","South East"]
[null,"Southend-on-Sea","East of England"]
[null,"Southwark","London"]
[null,"St. Helens","North West"]
[null,"Staffordshire","West Midlands"]
[null,"Stockport","North West"]
[null,"Stockton-On-Tees","North East"]
[null,"Stoke-on-Trent","West Midlands"]
[null,"Suffolk","East of England"]
[null,"Sunderland","North East"]
[null,"Surrey","South East"]
[null,"Sutton","London"]
[null,"Swindon","South West"]
[null,"Tameside","North West"]
[null,"Telford and Wrekin","West Midlands"]
[null,"Thurrock","East of England"]
[null,"Torbay","South West"]
[null,"Tower Hamlets","London"]
[null,"Trafford","North West"]
[null,"Wakefield","Yorkshire and the Humber"]
[null,"Walsall","West Midlands"]
[null,"Waltham Forest","London"]
[null,"Wandsworth","London"]
[null,"Warrington","North West"]
[null,"Warwickshire","West Midlands"]
[null,"West Berkshire","South East"]
[null,"West Sussex","South East"]
[null,"Westminster","London"]
[null,"Wigan","North West"]
[null,"Wiltshire","South West"]
[null,"Windsor and Maidenhead","South East"]
[null,"Wirral","North West"]
[null,"Wokingham","South East"]
[null,"Wolverhampton","West Midlands"]
[null,"Worcestershire","West Midlands"]
[null,"York","Yorkshire and the Humber"]

{"sheet":"Lancashire estimates","index":3,"n_rows":30,"n_cols":23,"rows_kept":30,"cut":false,"hidden":false,"merged":[[12,12,12,21],[13,0,14,0],[13,1,14,1],[13,2,14,2],[12,0,12,2],[13,16,14,16],[13,17,14,17],[13,18,14,18],[13,19,14,19],[13,20,14,20],[13,21,14,21],[13,11,14,11],[13,12,14,12],[13,13,14,13],[13,14,14,14],[13,15,14,15],[13,5,14,5],[13,6,14,6],[13,7,14,7],[13,8,14,8],[13,9,14,9],[13,10,14,10],[3,22,4,22],[3,15,4,15],[3,16,4,16],[12,3,12,11],[13,3,14,3],[13,4,14,4],[3,14,4,14],[3,17,4,17],[3,18,4,18],[3,19,4,19],[3,20,4,20],[3,21,4,21],[3,8,4,8],[3,9,4,9],[3,10,4,10],[3,11,4,11],[3,12,4,12],[3,13,4,13],[2,0,4,0],[2,1,4,1],[2,2,4,2],[2,3,2,11],[2,12,2,22],[3,3,4,3],[3,4,4,4],[3,5,4,5],[3,6,4,6],[3,7,4,7]]}
["National and local prevalence estimates and rates per 1,000 population aged 15 to 64 with 95% confidence intervals (CI) - 2014/15"]
[]
["Region","Local authority","15-64 population","Number of users",null,null,null,null,null,null,null,null,"Rate per thousand of the population"]
[null,null,null,"OCU","Lower bound  95% CI","Upper bound  95% CI","Opiate users","Lower bound  95% CI","Upper bound   95% CI","Crack users","Lower bound  95% CI","Upper bound  95% CI","OCU","Lower bound  95% CI","Upper bound  95% CI","Sig. V England","Sig. V NW","Opiate users","Lower bound  95% CI","Upper bound   95% CI","Crack users","Lower bound  95% CI","Upper bound  95% CI"]
[]
["ENGLAND","ENGLAND",35102533,300783,297986,311128,257476,255440,266643,182828,176675,190782,{"$f":"D6/$C6*1000","v":8.5686978771588933},8.4890170176608049,8.8634059542084902,"-","-",{"$f":"G6/$C6*1000","v":7.334969245666688},{"$f":"H6/$C6*1000","v":7.2769677333541711},{"$f":"I6/$C6*1000","v":7.5961184909362522},{"$f":"J6/$C6*1000","v":5.208399063395226},{"$f":"K6/$C6*1000","v":5.0331125676884909},{"$f":"L6/$C6*1000","v":5.4349923978420591}]
["North West","North West",4592973,48814,46661,52097,42647,41029,45239,28685,25980,31979,{"$f":"D7/$C7*1000","v":10.627974516723699},10.159214957283659,11.342762084601848,{"$f":"IF(N7>$O$6,\"High\",IF(O7<$N$6,\"Low\",\"NoDiff\"))","v":"High"},"-",{"$f":"G7/$C7*1000","v":9.285271217575195},{"$f":"H7/$C7*1000","v":8.9329939453160296},{"$f":"I7/$C7*1000","v":9.8496115696739341},{"$f":"J7/$C7*1000","v":6.245410108006296},{"$f":"K7/$C7*1000","v":5.6564669550637463},{"$f":"L7/$C7*1000","v":6.9625926387984434}]
["North West","Blackburn with Darwen",94178,1363,1157,1576,1210,1053,1376,712,536,999,{"$f":"D8/$C8*1000","v":14.472594448809701},12.285247085306548,16.734269149907622,"High",{"$f":"IF(N8>$O$7,\"High\",IF(O8<$N$7,\"Low\",\"NoDiff\"))","v":"High"},{"$f":"G8/$C8*1000","v":12.848011212809785},{"$f":"H8/$C8*1000","v":11.180955212470003},{"$f":"I8/$C8*1000","v":14.610630932914269},{"$f":"J8/$C8*1000","v":7.5601520524963366},{"$f":"K8/$C8*1000","v":5.691350421542186},{"$f":"L8/$C8*1000","v":10.607572893881798}]
["North West","Blackpool",88320,1762,1548,1974,1559,1406,1717,964,748,1298,19.950181159420289,17.527173913043477,22.350543478260867,"High","High",{"$f":"G9/$C9*1000","v":17.651721014492754},{"$f":"H9/$C9*1000","v":15.919384057971016},{"$f":"I9/$C9*1000","v":19.440670289855074},{"$f":"J9/$C9*1000","v":10.914855072463769},{"$f":"K9/$C9*1000","v":8.4692028985507246},{"$f":"L9/$C9*1000","v":14.696557971014494}]
["North West","Lancashire",749332,6711,5126,8342,5890,4602,7163,2690,817,4717,8.9559767899942884,6.8407595031307888,11.132582086444994,{"$f":"IF(N10>$O$6,\"High\",IF(O10<$N$6,\"Low\",\"NoDiff\"))","v":"NoDiff"},{"$f":"IF(N10>$O$7,\"High\",IF(O10<$N$7,\"Low\",\"NoDiff\"))","v":"NoDiff"},{"$f":"G10/$C10*1000","v":7.8603342710574218},{"$f":"H10/$C10*1000","v":6.1414700026156632},{"$f":"I10/$C10*1000","v":9.5591807102859612},{"$f":"J10/$C10*1000","v":3.5898640389039835},{"$f":"K10/$C10*1000","v":1.0903044311466745},{"$f":"L10/$C10*1000","v":6.294940026583677}]
[]
[]
["CIPFA nearest neigbours",null,null,"Number of users",null,null,null,null,null,null,null,null,"Rate per thousand of the population"]
["Region","Local authority","15-64 population","OCU","Lower bound  95% CI","Upper bound  95% CI","Opiate users","Lower bound  95% CI","Upper bound   95% CI","Crack users","Lower bound  95% CI","Upper bound  95% CI","OCU","Lower bound  95% CI","Upper bound  95% CI","Sig. V England","Opiate users","Lower bound  95% CI","Upper bound   95% CI","Crack users","Lower bound  95% CI","Upper bound  95% CI"]
[]
["East Midlands","Leicester",229750,2798,2266,3305,2298,1869,2747,1526,1180,2121,{"$f":"D16/$C16*1000","v":12.178454842219804},{"$f":"E16/$C16*1000","v":9.8628944504896641},{"$f":"F16/$C16*1000","v":14.385201305767138},{"$f":"IF(N16>$O$6,\"High\",IF(O16<$N$6,\"Low\",\"NoDiff\"))","v":"High"},{"$f":"G16/$C16*1000","v":10.002176278563656},{"$f":"H16/$C16*1000","v":8.1349292709466816},{"$f":"I16/$C16*1000","v":11.956474428726876},{"$f":"J16/$C16*1000","v":6.6420021762785639},{"$f":"K16/$C16*1000","v":5.1360174102285097},{"$f":"L16/$C16*1000","v":9.2317736670293797}]
["North West","Lancashire",749332,6711,5126,8342,5890,4602,7163,2690,817,4717,{"$f":"D17/$C17*1000","v":8.9559767899942884},{"$f":"E17/$C17*1000","v":6.8407595031307888},{"$f":"F17/$C17*1000","v":11.132582086444994},{"$f":"IF(N17>$O$6,\"High\",IF(O17<$N$6,\"Low\",\"NoDiff\"))","v":"NoDiff"},{"$f":"G17/$C17*1000","v":7.8603342710574218},{"$f":"H17/$C17*1000","v":6.1414700026156632},{"$f":"I17/$C17*1000","v":9.5591807102859612},{"$f":"J17/$C17*1000","v":3.5898640389039835},{"$f":"K17/$C17*1000","v":1.0903044311466745},{"$f":"L17/$C17*1000","v":6.294940026583677}]
["North West","Cumbria",308487,2744,2466,3261,2687,2390,3295,829,376,2156,{"$f":"D18/$C18*1000","v":8.8950263706412258},{"$f":"E18/$C18*1000","v":7.9938538739071658},{"$f":"F18/$C18*1000","v":10.570947884351691},{"$f":"IF(N18>$O$6,\"High\",IF(O18<$N$6,\"Low\",\"NoDiff\"))","v":"NoDiff"},{"$f":"G18/$C18*1000","v":8.7102535925338831},{"$f":"H18/$C18*1000","v":7.7474901697640419},{"$f":"I18/$C18*1000","v":10.681163225678876},{"$f":"J18/$C18*1000","v":2.6873093517717117},{"$f":"K18/$C18*1000","v":1.2188520099712468},{"$f":"L18/$C18*1000","v":6.9889492912181064}]
["East Midlands","Derbyshire",494609,4043,2950,5071,3481,2628,4329,2342,1758,3206,{"$f":"D19/$C19*1000","v":8.1741335074776238},{"$f":"E19/$C19*1000","v":5.9643071597969302},{"$f":"F19/$C19*1000","v":10.252542917739062},{"$f":"IF(N19>$O$6,\"High\",IF(O19<$N$6,\"Low\",\"NoDiff\"))","v":"NoDiff"},{"$f":"G19/$C19*1000","v":7.0378824485603779},{"$f":"H19/$C19*1000","v":5.3132878698123163},{"$f":"I19/$C19*1000","v":8.7523680321223427},{"$f":"J19/$C19*1000","v":4.7350533451675973},{"$f":"K19/$C19*1000","v":3.5543227074315271},{"$f":"L19/$C19*1000","v":6.4818877133250714}]
["East Midlands","Nottinghamshire",508409,3917,3658,4246,3818,3256,5214,1946,1516,2429,{"$f":"D20/$C20*1000","v":7.7044269475953415},{"$f":"E20/$C20*1000","v":7.1949945811344804},{"$f":"F20/$C20*1000","v":8.351543737424004},{"$f":"IF(N20>$O$6,\"High\",IF(O20<$N$6,\"Low\",\"NoDiff\"))","v":"Low"},{"$f":"G20/$C20*1000","v":7.509701834546596},{"$f":"H20/$C20*1000","v":6.4042926069365418},{"$f":"I20/$C20*1000","v":10.255522620567298},{"$f":"J20/$C20*1000","v":3.8276269696248493},{"$f":"K20/$C20*1000","v":2.9818512260797903},{"$f":"L20/$C20*1000","v":4.7776494908626717}]
["East Midlands","Northamptonshire",458011,3415,2371,4426,2908,2158,3700,1146,977,1368,{"$f":"D21/$C21*1000","v":7.4561527998235846},{"$f":"E21/$C21*1000","v":5.1767315632157302},{"$f":"F21/$C21*1000","v":9.6635233651593531},{"$f":"IF(N21>$O$6,\"High\",IF(O21<$N$6,\"Low\",\"NoDiff\"))","v":"NoDiff"},{"$f":"G21/$C21*1000","v":6.349192486643334},{"$f":"H21/$C21*1000","v":4.7116772304595305},{"$f":"I21/$C21*1000","v":8.0784085971734303},{"$f":"J21/$C21*1000","v":2.5021233114488517},{"$f":"K21/$C21*1000","v":2.1331365403887679},{"$f":"L21/$C21*1000","v":2.9868278272792574}]
["East of England","Norfolk",534602,3981,3619,4461,3531,3277,3965,2279,1832,2857,{"$f":"D22/$C22*1000","v":7.4466612545407616},{"$f":"E22/$C22*1000","v":6.7695219995435858},{"$f":"F22/$C22*1000","v":8.3445254600618775},{"$f":"IF(N22>$O$6,\"High\",IF(O22<$N$6,\"Low\",\"NoDiff\"))","v":"Low"},{"$f":"G22/$C22*1000","v":6.6049135618647137},{"$f":"H22/$C22*1000","v":6.1297937531097908},{"$f":"I22/$C22*1000","v":7.4167324476900571},{"$f":"J22/$C22*1000","v":4.2629844257971357},{"$f":"K22/$C22*1000","v":3.426848384405595},{"$f":"L22/$C22*1000","v":5.3441625732788127}]
["South West","Gloucestershire",385736,2829,1981,3658,2418,1743,3070,1938,900,2880,{"$f":"D23/$C23*1000","v":7.3340315656303794},{"$f":"E23/$C23*1000","v":5.1356368085944792},{"$f":"F23/$C23*1000","v":9.4831698363647678},{"$f":"IF(N23>$O$6,\"High\",IF(O23<$N$6,\"Low\",\"NoDiff\"))","v":"NoDiff"},{"$f":"G23/$C23*1000","v":6.2685359935292535},{"$f":"H23/$C23*1000","v":4.5186345065018569},{"$f":"I23/$C23*1000","v":7.9588112076653461},{"$f":"J23/$C23*1000","v":5.0241616027542157},{"$f":"K23/$C23*1000","v":2.3332019827031956},{"$f":"L23/$C23*1000","v":7.4662463446502265}]
["East Midlands","Lincolnshire",451696,3100,2830,3571,2929,2664,3403,1438,348,2588,{"$f":"D24/$C24*1000","v":6.8630229180687889},{"$f":"E24/$C24*1000","v":6.2652757606886045},{"$f":"F24/$C24*1000","v":7.9057596259431113},{"$f":"IF(N24>$O$6,\"High\",IF(O24<$N$6,\"Low\",\"NoDiff\"))","v":"Low"},{"$f":"G24/$C24*1000","v":6.4844497183946723},{"$f":"H24/$C24*1000","v":5.8977719528178243},{"$f":"I24/$C24*1000","v":7.5338280613509978},{"$f":"J24/$C24*1000","v":3.1835570826396511},{"$f":"K24/$C24*1000","v":0.77042966951223824},{"$f":"L24/$C24*1000","v":5.7295171974071053}]
["East of England","Suffolk",450636,2851,1862,3822,2391,1633,3148,1097,930,1344,{"$f":"D25/$C25*1000","v":6.3266139411853466},{"$f":"E25/$C25*1000","v":4.1319379721105278},{"$f":"F25/$C25*1000","v":8.4813463638058213},{"$f":"IF(N25>$O$6,\"High\",IF(O25<$N$6,\"Low\",\"NoDiff\"))","v":"Low"},{"$f":"G25/$C25*1000","v":5.3058344206854313},{"$f":"H25/$C25*1000","v":3.6237672977747009},{"$f":"I25/$C25*1000","v":6.9856824576820324},{"$f":"J25/$C25*1000","v":2.4343372478008858},{"$f":"K25/$C25*1000","v":2.0637499001411341},{"$f":"L25/$C25*1000","v":2.9824514685910581}]
["West Midlands","Staffordshire",545413,3446,3143,3939,2679,2506,2965,1991,568,3325,{"$f":"D26/$C26*1000","v":6.3181478989316355},{"$f":"E26/$C26*1000","v":5.7626055851254003},{"$f":"F26/$C26*1000","v":7.2220500794810532},{"$f":"IF(N26>$O$6,\"High\",IF(O26<$N$6,\"Low\",\"NoDiff\"))","v":"Low"},{"$f":"G26/$C26*1000","v":4.9118741210788892},{"$f":"H26/$C26*1000","v":4.5946832950443062},{"$f":"I26/$C26*1000","v":5.4362473941765233},{"$f":"J26/$C26*1000","v":3.6504447088719925},{"$f":"K26/$C26*1000","v":1.0414126542638331},{"$f":"L26/$C26*1000","v":6.0962976680057128}]
["East of England","Essex",896821,5463,3370,7351,4492,2879,6002,4236,1859,6429,{"$f":"D27/$C27*1000","v":6.0915165902671768},{"$f":"E27/$C27*1000","v":3.7577175378364247},{"$f":"F27/$C27*1000","v":8.1967304512271681},{"$f":"IF(N27>$O$6,\"High\",IF(O27<$N$6,\"Low\",\"NoDiff\"))","v":"Low"},{"$f":"G27/$C27*1000","v":5.0088033174959108},{"$f":"H27/$C27*1000","v":3.2102281280210878},{"$f":"I27/$C27*1000","v":6.6925283863781067},{"$f":"J27/$C27*1000","v":4.7233505905860813},{"$f":"K27/$C27*1000","v":2.0728774192397368},{"$f":"L27/$C27*1000","v":7.1686546144659857}]
["West Midlands","Warwickshire",348267,2100,1843,2574,2085,1766,2552,1291,1024,1571,{"$f":"D28/$C28*1000","v":6.0298564032767965},{"$f":"E28/$C28*1000","v":5.2919168339233984},{"$f":"F28/$C28*1000","v":7.3908811343021306},{"$f":"IF(N28>$O$6,\"High\",IF(O28<$N$6,\"Low\",\"NoDiff\"))","v":"Low"},{"$f":"G28/$C28*1000","v":5.986786000396247},{"$f":"H28/$C28*1000","v":5.0708220991365813},{"$f":"I28/$C28*1000","v":7.3277112100773261},{"$f":"J28/$C28*1000","v":3.7069260079192112},{"$f":"K28/$C28*1000","v":2.9402728366454474},{"$f":"L28/$C28*1000","v":4.5109068616894508}]
["South East","Kent",945347,5198,3163,7156,4401,2759,6086,3398,2780,4206,{"$f":"D29/$C29*1000","v":5.4985100709051808},{"$f":"E29/$C29*1000","v":3.3458613609605785},{"$f":"F29/$C29*1000","v":7.569707208041069},{"$f":"IF(N29>$O$6,\"High\",IF(O29<$N$6,\"Low\",\"NoDiff\"))","v":"Low"},{"$f":"G29/$C29*1000","v":4.6554334017032897},{"$f":"H29/$C29*1000","v":2.918505056873296},{"$f":"I29/$C29*1000","v":6.4378476897900985},{"$f":"J29/$C29*1000","v":3.5944473299222404},{"$f":"K29/$C29*1000","v":2.9407191221847642},{"$f":"L29/$C29*1000","v":4.4491599380968045}]
["Yorkshire and the Humber","North Yorkshire",368824,1953,1735,2295,1798,1622,2178,1099,254,2042,{"$f":"D30/$C30*1000","v":5.2952085547578251},{"$f":"E30/$C30*1000","v":4.7041407283690866},{"$f":"F30/$C30*1000","v":6.2224800989089655},{"$f":"IF(N30>$O$6,\"High\",IF(O30<$N$6,\"Low\",\"NoDiff\"))","v":"Low"},{"$f":"G30/$C30*1000","v":4.8749539075548229},{"$f":"H30/$C30*1000","v":4.397761533956575},{"$f":"I30/$C30*1000","v":5.905255623278312},{"$f":"J30/$C30*1000","v":2.9797410146845107},{"$f":"K30/$C30*1000","v":0.68867535735201613},{"$f":"L30/$C30*1000","v":5.5365160618614837}]

{"sheet":"2014-15 Prevalence Estimates","index":4,"n_rows":169,"n_cols":21,"rows_kept":169,"cut":false,"hidden":false,"merged":[[3,0,5,0],[4,5,5,5],[4,11,5,11],[4,10,5,10],[3,2,5,2],[3,1,5,1],[4,4,5,4],[4,3,5,3],[3,3,3,11],[4,9,5,9],[4,8,5,8],[4,7,5,7],[4,6,5,6],[3,12,3,20],[4,20,5,20],[4,19,5,19],[4,18,5,18],[4,17,5,17],[4,16,5,16],[4,15,5,15],[4,14,5,14],[4,12,5,12],[4,13,5,13]]}
["National and local prevalence estimates and rates per 1,000 population aged 15 to 64 with 95% confidence intervals (CI) - 2014/15"]
[]
[]
["Region","Local authority","15-64 population","Number of users",null,null,null,null,null,null,null,null,"Rate per thousand of the population"]
[null,null,null,"OCU","Lower bound  95% CI","Upper bound  95% CI","Opiate users","Lower bound  95% CI","Upper bound   95% CI","Crack users","Lower bound  95% CI","Upper bound  95% CI","OCU","Lower bound  95% CI","Upper bound  95% CI","Opiate users","Lower bound  95% CI","Upper bound   95% CI","Crack users","Lower bound  95% CI","Upper bound  95% CI"]
[]
["East Midlands","Derby",162899,2317,2092,2836,1989,1828,2357,1010,556,1418,{"$f":"D7/$C7*1000","v":14.223537283838452},{"$f":"E7/$C7*1000","v":12.842313335256817},17.409560525233427,12.210019705461667,11.221677235587697,14.469088208030744,6.2001608358553453,3.4131578462728438,8.7047802626167137]
["East Midlands","Derbyshire",494609,4043,2950,5071,3481,2628,4329,2342,1758,3206,{"$f":"D8/$C8*1000","v":8.1741335074776238},{"$f":"E8/$C8*1000","v":5.9643071597969302},{"$f":"F8/$C8*1000","v":10.252542917739062},{"$f":"G8/$C8*1000","v":7.0378824485603779},{"$f":"H8/$C8*1000","v":5.3132878698123163},{"$f":"I8/$C8*1000","v":8.7523680321223427},{"$f":"J8/$C8*1000","v":4.7350533451675973},{"$f":"K8/$C8*1000","v":3.5543227074315271},{"$f":"L8/$C8*1000","v":6.4818877133250714}]
["East Midlands","Leicester",229750,2798,2266,3305,2298,1869,2747,1526,1180,2121,12.178454842219804,9.8628944504896641,14.385201305767138,10.002176278563656,8.1349292709466816,11.956474428726876,6.6420021762785639,5.1360174102285097,9.2317736670293797]
["East Midlands","Leicestershire",426895,2700,1813,3720,2285,1561,3047,1478,377,2541,6.3247402757118261,4.2469459703205708,8.7140866020918502,5.352604270370934,3.6566368779208003,7.1375865259607165,3.4622096768526216,0.88312114220124394,5.952283348364352]
["East Midlands","Lincolnshire",451696,3100,2830,3571,2929,2664,3403,1438,348,2588,6.8630229180687889,6.2652757606886045,7.9057596259431113,6.4844497183946723,5.8977719528178243,7.5338280613509978,3.1835570826396511,0.77042966951223824,5.7295171974071053]
["East Midlands","Northamptonshire",458011,3415,2371,4426,2908,2158,3700,1146,977,1368,7.4561527998235846,5.1767315632157302,9.6635233651593531,6.349192486643334,4.7116772304595305,8.0784085971734303,2.5021233114488517,2.1331365403887679,2.9868278272792574]
["East Midlands","Nottingham",222301,2700,2367,3360,2400,2124,2937,1391,1268,1547,12.145694351352446,10.647725381352311,15.114641859460821,10.796172756757729,9.5546128897305902,13.211816411082271,6.2572817936041671,5.7039779398203336,6.9590330227934194]
["East Midlands","Nottinghamshire",508409,3917,3658,4246,3818,3256,5214,1946,1516,2429,7.7044269475953415,7.1949945811344804,8.351543737424004,7.509701834546596,6.4042926069365418,10.255522620567298,3.8276269696248493,2.9818512260797903,4.7776494908626717]
["East Midlands","Rutland",23309,67,17,123,55,17,96,54,5,114,2.8744261873096231,0.72933201767557587,5.2769316572997553,2.3596035865974518,0.72933201767557587,4.1185808056973698,2.316701703204771,0.21450941696340467,4.8908147067656271]
["East of England","Bedfordshire \n(Bedford UA/Central Bedfordshire UA)",279316,2195,1563,2849,1829,1375,2282,1690,989,2470,7.8584828652851959,5.5958126279912355,10.199916939953315,6.548139025333314,4.9227398358848049,8.1699580403557253,6.0504947801056863,3.540792507410961,8.8430308324621585]
["East of England","Bedford",105044,1240.4668335419274,882,1608,1035,776,1288,964,564,1409,{"$f":"D17/$C17*1000","v":11.809021300996985},8.3964814744297644,15.307870987395759,9.8530139750961503,7.3873805262556642,12.261528502341875,9.17710673622482,5.3691786299074673,13.413426754502874]
["East of England","Central Bedfordshire",174272,954.53316645807263,681,1241,794,599,994,726,425,1061,5.4772606411705418,3.9076845391112744,7.1210521483657727,4.5560962174072719,3.4371557106132942,5.703727506426735,4.1659015791406535,2.4387164891663606,6.0881839882482556]
["East of England","Cambridgeshire",416607,2227,1997,2579,1954,1764,2440,1032,764,1314,5.345565484977449,4.7934864272563837,6.1904864776636019,4.690271646899836,4.2342063383476507,5.8568386993017398,2.4771547285571294,1.8338626091256267,3.1540516601977404]
["East of England","Essex",896821,5463,3370,7351,4492,2879,6002,4236,1859,6429,6.0915165902671768,3.7577175378364247,8.1967304512271681,5.0088033174959108,3.2102281280210878,6.6925283863781067,4.7233505905860813,2.0728774192397368,7.1686546144659857]
["East of England","Hertfordshire",744177,4226,2589,5921,3418,2957,4100,3535,1585,5380,5.6787565323840967,3.479011041727976,7.9564404704794702,4.5929933335752109,3.9735170530666761,5.5094419741539982,4.750213994788874,2.1298696412278262,7.2294628831581731]
["East of England","Luton",138867,1715,1389,2038,1411,1177,1652,1485,1238,1803,12.349946351545004,10.002376374516624,14.675912923876803,10.160801342291544,8.4757357759582899,11.896274852916818,10.693685324807189,8.915005004788755,12.983646222644689]
["East of England","Norfolk",534602,3981,3619,4461,3531,3277,3965,2279,1832,2857,7.4466612545407616,6.7695219995435858,8.3445254600618775,6.6049135618647137,6.1297937531097908,7.4167324476900571,4.2629844257971357,3.426848384405595,5.3441625732788127]
["East of England","Peterborough",123492,1537,1279,1816,1352,1160,1564,855,520,1041,12.446150357917922,10.356946198944062,14.705406018203607,10.948077608266122,9.3933210248437149,12.664788002461698,6.9235254105529105,4.2107990801023547,8.4296958507433679]
["East of England","Southend-on-Sea",112473,1033,933,1192,931,810,1203,819,688,1003,9.1844264845785197,8.295324211144008,10.598099099339397,8.2775421656753174,7.2017284148195566,10.695900349417192,7.2817476194286623,6.1170236412294505,8.9176958025481667]
["East of England","Suffolk",450636,2851,1862,3822,2391,1633,3148,1097,930,1344,6.3266139411853466,4.1319379721105278,8.4813463638058213,5.3058344206854313,3.6237672977747009,6.9856824576820324,2.4343372478008858,2.0637499001411341,2.9824514685910581]
["East of England","Thurrock",106999,682,507,972,518,397,767,380,254,633,6.3738913447789232,4.7383620407667362,9.0841970485705481,4.8411667398760736,3.7103150496733615,7.1682912924419862,3.5514350601407489,2.3738539612519745,5.9159431396555107]
["London","Barking and Dagenham",127641,1150,1002,1398,861,771,1088,916,741,1168,9.0096442365697538,7.8501421956894726,10.952593602369145,6.7454814675535291,6.040378875126331,8.5239068951199073,7.1763774962590396,5.8053446776505986,9.1506647550551925]
["London","Barnet",248267,1668,1384,2529,1390,1100,1850,1030,822,1360,6.718573149069349,5.5746434282445918,10.18661360551342,5.5988109575577907,4.4307137074198346,7.4516548715697208,4.1487591987658448,3.3109515159082763,5.4779733109917954]
["London","Bexley",153764,724,587,1485,541,411,825,636,459,888,4.7085143466611168,3.817538565594027,9.6576571889388934,3.5183788142868293,2.6729273432012692,5.3653651049660516,4.1362087354647379,2.9850940402174762,5.7750838947998231]
["London","Brent",222206,1890,1400,2431,1410,1042,1809,1487,974,2076,8.5056209103264528,6.3004599335751506,10.940298641800851,6.3454632188149738,4.6893423219895052,8.1410942998838927,6.691988515161607,4.3833199823587119,9.3426820157871528]
["London","Bromley",205012,1221,964,1668,870,687,1182,837,599,1223,5.9557489317698478,4.7021637757789785,8.1361091058084405,4.2436540300079999,3.3510233547304549,5.76551616490742,4.0826878426628692,2.921780188476772,5.9655044582756132]
["London","Camden",169410,2097,1721,2479,1718,1425,2010,1552,1094,1992,12.378253940145211,10.158786376246974,14.633138539637566,10.141077858449913,8.4115459536036834,11.864706924030459,9.1612065403459066,6.4577061566613541,11.758455817248096]
["London","City of London",5955,28,14,43,23,13,33,21,12,45,4.7019311502938708,2.3509655751469354,7.2208228379513013,3.8623005877413936,2.1830394626364398,5.541561712846347,3.5264483627204029,2.0151133501259446,7.5566750629722916]
["London","Croydon",249571,2028,1803,2418,1486,1306,1772,1231,1013,1553,8.125944120110109,7.2243970653641654,9.6886256816697465,5.9542174371221019,5.2329797933253461,7.1001839155991684,4.9324641084100316,4.0589651842561834,6.2226781156464499]
["London","Ealing",233841,2464,1928,2986,2029,1616,2441,1525,870,2104,10.537074336835712,8.244918555770802,12.769360377350422,8.6768359697401216,6.9106786235091366,10.438716905931807,6.5215253099328176,3.7204767341911813,8.9975667226876368]
["London","Enfield",213689,1789,1523,2294,1368,1129,2009,1182,965,1507,8.3719798398607335,7.1271801543364424,10.73522736313053,6.4018269541249202,5.283379116379411,9.4015134143545058,5.5314031138710931,4.5159086335749619,7.0523049852823494]
["London","Greenwich",184827,1447,1031,1885,1111,804,1432,1161,664,1700,7.8289427410497394,5.5781893338094539,10.198726376557536,6.0110265275095092,4.3500137966855492,7.7477857672309787,6.2815497735720429,3.5925487077104536,9.1977903661261617]
["London","Hackney",192530,2553,2132,2980,1989,1657,2297,2151,1596,2686,13.260271126577676,11.073598919648886,15.478107307952007,10.330857528696827,8.6064509427102269,11.930608216901261,11.172284838726432,8.2896172025138934,13.951072560120501]
["London","Hammersmith and Fulham",130917,1500,1181,1804,1178,936,1413,1240,1022,1597,11.457641100850157,9.0209827600693568,13.779723030622455,8.9980674778676573,7.1495680469304981,10.793097917000848,9.471649976702798,7.8064728033792399,12.198568558705134]
["London","Haringey",192241,1856,1426,2294,1406,1067,1737,1555,1014,2077,9.6545481973148277,7.4177724834972762,11.932938343017359,7.3137364037848327,5.5503248526589024,9.0355335230257854,8.088805197642543,5.2746292414209242,10.804146878137338]
["London","Harrow",162324,1193,976,1508,1002,792,1538,760,559,1069,7.3494985337966048,6.0126660259727451,9.2900618516054312,6.1728395061728394,4.8791306276336215,9.4748774056824629,4.6819940366181214,3.4437298243020131,6.5855942436115429]
["London","Havering",156282,894,725,1149,746,582,1231,601,479,802,5.7204284562521597,4.6390499225758557,7.3520942910891849,4.7734224030918462,3.7240373171574461,7.8767868340563849,3.8456124185766756,3.0649722936742556,5.1317490178011544]
["London","Hillingdon",195572,2046,1749,2625,1344,1004,1689,1174,928,1572,10.461620272840692,8.94299797517027,13.422166772339599,6.8721493874378741,5.1336592150205549,8.6362055918025078,6.0029043012292149,4.7450555294213892,8.0379604442353703]
["London","Hounslow",183243,1536,1092,1961,1280,967,1577,1151,875,1584,8.3823120119185983,5.9592999459733802,10.701636624591389,6.9852600099321664,5.2771456481284416,8.606058621611739,6.2812767745561908,4.7750800849145669,8.6442592622910563]
["London","Islington",168008,2168,1809,2548,1749,1444,2019,1642,1207,2091,12.904147421551354,10.76734441217085,15.165944478834341,10.410218561020905,8.5948288176753476,12.017284891195656,9.7733441264701675,7.1841817056330655,12.445835912575593]
["London","Kensington and Chelsea",110224,1250,1053,1982,794,610,972,892,675,1289,11.340542894469444,9.5532733343010605,17.981564813470751,7.2035128465669906,5.5341849325010886,8.8184061547394386,8.0926114094933954,6.1238931630134994,11.694367832776891]
["London","Kingston upon Thames",116054,553,441,877,450,365,722,275,209,395,4.7650231788650119,3.7999551932720972,7.5568269943302262,3.8775052992572427,3.1450876316197633,6.2212418356971755,2.3695865717683149,1.8008857945439192,3.4035879849035795]
["London","Lambeth",239858,2387,1806,2967,1818,1406,2209,2000,1385,2628,9.951721435182483,7.5294549274987705,12.369818809462267,7.5794845283459384,5.8618015659265073,9.2096156892828258,8.3382668078613182,5.7742497644439625,10.956482585529772]
["London","Lewisham",207028,1940,1445,2430,1486,1107,1842,1593,1076,2142,9.37071314025156,6.9797322101358272,11.737542747840871,7.1777730548524836,5.3471028073497306,8.8973472187336977,7.6946113569179042,5.197364607685917,10.346426570318991]
["London","Merton",139503,635,339,959,492,248,731,518,322,911,4.5518734364135538,2.4300552676286533,6.8744041346781071,3.5268058751424705,1.7777395468197816,5.2400306803437919,3.7131817953735764,2.3081940890160069,6.530325512712988]
["London","Newham",231356,2400,1880,2951,1877,1481,2322,2089,1785,2460,10.373623333736752,8.1260049447604565,12.755234357440481,8.113037915593285,6.4013900655267211,10.036480575390307,9.0293746434066975,7.7153823544667093,10.63296391708017]
["London","Redbridge",194533,1133,695,1570,895,549,1208,784,262,1331,5.8242046336611262,3.5726586234726239,8.0706101278446329,4.6007618244719408,2.8221432867431231,6.2097433340358705,4.0301645479173205,1.3468151933091044,6.8420268026504498]
["London","Richmond upon Thames",127393,822,586,1214,628,460,1000,410,269,730,6.45247384079188,4.5999387721460359,9.5295659887120951,4.9296272165660593,3.6108734388859673,7.8497248671434061,3.2183871955287966,2.1115759892615764,5.7302991530146876]
["London","Southwark",225235,2257,1774,2728,1791,1418,2195,1904,1316,2508,10.020645104002487,7.8762181721313294,12.111794348125292,7.9516948964414942,6.2956467689302285,9.7453770506360016,8.4533931227384738,5.8427864230692386,11.135036739405511]
["London","Sutton",130208,836,670,1157,736,561,1022,506,363,729,6.4204964364708772,5.1456131727697221,8.8857827476038338,5.652494470385844,4.308491029737036,7.8489800933890397,3.8860899483902678,2.7878471368886704,5.598734332759892]
["London","Tower Hamlets",212492,2798,2342,3245,2309,1937,2672,2543,1982,3169,13.167554543229864,11.02159140108804,15.271163149671517,10.866291436854093,9.1156372945805018,12.574591043427517,11.967509365058451,9.3274099730813393,14.913502625981213]
["London","Waltham Forest",185135,1478,1038,1959,1330,1150,1703,1172,651,1668,7.9833634915061991,5.6067194209630804,10.581467577713561,7.1839468495962411,6.2116833661922382,9.1986928457612027,6.3305155697193944,3.5163529316444753,9.0096416128770898]
["London","Wandsworth",230792,1497,953,2007,1140,729,1510,1295,709,1864,6.4863600124787686,4.1292592464210198,8.6961419806579077,4.9395126347533704,3.1586883427501822,6.5426877881382373,5.6111130368470308,3.072030226351,8.0765364484037576]
["London","Westminster",170667,2249,1946,2733,1503,1241,1790,1393,1133,1794,13.177708637287818,11.402321479840859,16.013640598358204,8.8066234245636235,7.2714701729098188,10.488260765115692,8.1620934334112629,6.6386589088693189,10.511698219339415]
["North East","County Durham",333476,2311,2168,2584,2001,1886,2206,815,145,1696,6.9300339454713376,6.5012174789190222,7.7486835634348505,6.0004318151831013,5.6555794120116589,6.6151687077930648,2.4439539876932677,0.43481389965094935,5.0858232676414499]
["North East","Darlington",66389,806,652,951,656,583,854,200,43,371,12.140565455120578,9.8209040654325257,14.324662218138547,9.8811550106192279,8.7815752609619064,12.863576797361009,3.0125472593351312,0.64769766075705315,5.5882751660666674]
["North East","Gateshead",129613,1762,1591,2118,1615,1436,1862,376,99,718,13.594315385030823,12.275003278992076,16.340953453743065,12.460169890365936,11.079135580535903,14.365842932421902,2.9009435781904593,0.76381227191716883,5.5395677902679514]
["North East","Hartlepool",58929,1044,931,1327,918,841,1125,210,71,359,17.716234791019701,15.79867297934803,22.518624106976194,15.578068523138015,14.271411359432538,19.090770248943642,3.5636104464694802,1.2048397223777767,6.0920769061073496]
["North East","Middlesbrough",90472,2174,1957,2401,1936,1756,2113,734,481,974,24.02953399946945,21.631001856928108,26.538597577150941,21.398885843133787,19.409320010611015,23.355292245114512,8.113007339287293,5.3165620302414007,10.765761782650985]
["North East","Newcastle upon Tyne",201161,2051,1582,2527,1783,1447,2121,1076,674,1894,10.195813303771606,7.8643474629774159,12.56207714218959,8.8635471090320692,7.1932432230899623,10.543793280009544,5.3489493490288869,3.3505500569195816,9.4153439284950853]
["North East","North Tyneside",130396,1108,922,1490,934,808,1607,344,71,676,8.4971931654345223,7.0707690419951534,11.426730881315377,7.1627964047976933,6.1965090953710238,12.323997668640143,2.6381177336728121,0.54449522991502808,5.1842081045430843]
["North East","Northumberland",195896,1256,1105,1764,1092,995,1414,451,51,949,6.4115653203740761,5.6407481520806959,9.0047780454935271,5.5743864091150401,5.0792257116020751,7.2181157348797322,2.3022420059623472,0.26034222240372445,4.8444072364928337]
["North East","Redcar and Cleveland",83710,1197,968,1809,953,826,1256,517,242,1267,14.299366861784733,11.563731931668856,21.610321347509259,11.384541870744236,9.867399354915781,15.004181101421574,6.1760840998685946,2.8909329829172141,15.135587146099629]
["North East","South Tyneside",95844,715,620,884,588,524,699,239,44,491,7.4600392304160934,6.4688452067943745,9.2233212303326244,6.1349693251533743,5.4672175618713741,7.2931012895955929,2.4936354910062186,0.45907933725637495,5.1229080589290934]
["North East","Stockton-On-Tees",125450,1898,1665,2298,1657,1491,1974,917,705,1248,15.129533678756477,13.272220007971304,18.318055001992825,13.208449581506576,11.885213232363492,15.735352730171384,7.3096851335193307,5.6197688322040653,9.9481865284974091]
["North East","Sunderland",181041,1353,1197,1589,1281,963,1574,452,332,627,{"$f":"D72/$C72*1000","v":7.4734452416855852},{"$f":"E72/$C72*1000","v":6.611761976568844},{"$f":"F72/$C72*1000","v":8.7770173607083493},{"$f":"G72/$C72*1000","v":7.075745273170166},{"$f":"H72/$C72*1000","v":5.3192370788937309},{"$f":"I72/$C72*1000","v":8.6941632006009701},{"$f":"J72/$C72*1000","v":2.4966720245690199},{"$f":"K72/$C72*1000","v":1.8338387437099883},{"$f":"L72/$C72*1000","v":3.4633038924884416}]
["North West","Blackburn with Darwen",94178,1363,1157,1576,1210,1053,1376,712,536,999,14.472594448809701,12.285247085306548,16.734269149907622,12.848011212809785,11.180955212470003,14.610630932914269,7.5601520524963366,5.691350421542186,10.607572893881798]
["North West","Blackpool",88320,1762,1548,1974,1559,1406,1717,964,748,1298,19.950181159420289,17.527173913043477,22.350543478260867,17.651721014492754,15.919384057971016,19.440670289855074,10.914855072463769,8.4692028985507246,14.696557971014494]
["North West","Bolton",178883,2748,2373,3421,2546,2192,3145,1084,880,1401,15.361996388700994,13.265654086749439,19.124232039936718,14.232766668716422,12.253819535674156,17.581324105700375,6.0598268141746274,4.9194166019129826,7.8319348400910096]
["North West","Bury",119036,1168,917,1646,735,650,871,604,288,916,9.8121576665882593,7.7035518666621856,13.827749588359824,6.174602641217783,5.4605329480157261,7.317114150341073,5.0740952316946126,2.4194361369669677,7.6951510467421622]
["North West","Cheshire \n(Cheshire West, Cheshire East and Cheshire UA)",442009,3284,2360,4247,2885,2185,3660,2023,933,3240,7.4297129696454141,5.3392577979181421,9.6084016388806557,6.5270164182177286,4.9433382578182803,8.2803743815171185,4.5768298835544066,2.1108167480752655,7.3301674852774488]
["North West","Cheshire East",231871,1481.8376432980599,1332,1289,1307,997,1670,988,456,1582,{"$f":"D78/$C78*1000","v":6.3907847177873034},{"$f":"E78/$C78*1000","v":5.7445734912947284},{"$f":"F78/$C78*1000","v":5.5591255482574367},{"$f":"G78/$C78*1000","v":5.6367549197614188},{"$f":"H78/$C78*1000","v":4.2998046327483816},{"$f":"I78/$C78*1000","v":7.2022805784250723},{"$f":"J78/$C78*1000","v":4.2609899469963901},{"$f":"K78/$C78*1000","v":1.9666107447675647},{"$f":"L78/$C78*1000","v":6.8227592066278238}]
["North West","Cheshire West and Chester",210138,1802.1623567019401,1289,2319,1578,1188,1990,1035,477,1658,8.5760897919554768,6.1340642815673512,11.035605173742969,7.5093509979156554,5.6534277474802268,9.4699673547859025,4.9253347800017133,2.269936898609485,7.8900532031331796]
["North West","Cumbria",308487,2744,2466,3261,2687,2390,3295,829,376,2156,8.8950263706412258,7.9938538739071658,10.570947884351691,8.7102535925338831,7.7474901697640419,10.681163225678876,2.6873093517717117,1.2188520099712468,6.9889492912181064]
["North West","Halton",81709,699,595,878,647,483,1120,643,451,1040,8.5547491708379741,7.2819395660208786,10.745450317590473,7.9183443684294268,5.9112215300640081,13.707180359568712,7.8693901528595376,5.5195878055049015,12.728096048170947]
["North West","Knowsley",95519,1090,880,1317,949,776,1108,664,432,912,11.41134224604529,9.2128267674494086,13.787832787194171,9.9351961389880543,8.124038149478114,11.599786429924936,6.951496560893645,4.5226604131115273,9.5478386499021148]
["North West","Lancashire",749332,6711,5126,8342,5890,4602,7163,2690,817,4717,8.9559767899942884,6.8407595031307888,11.132582086444994,7.8603342710574218,6.1414700026156632,9.5591807102859612,3.5898640389039835,1.0903044311466745,6.294940026583677]
["North West","Liverpool",328951,5257,4518,5997,4594,3978,5181,3649,2702,4568,15.981103568616602,13.73456837036519,18.230678733306785,13.965605819711751,12.092986493429112,15.750066119270041,11.092837535073613,8.2139893175579353,13.886566692303717]
["North West","Manchester",372726,4314,3489,5126,3754,3092,4396,4037,3499,4668,11.57418586307368,9.3607636709003401,13.752729887370347,10.07174170838632,8.2956380826666241,11.794186614295757,10.831012593701541,9.3875930308054709,12.523945203715328]
["North West","Oldham",144418,1662,1450,1999,1315,1150,1834,1088,825,1478,11.508260743120664,10.040299685634755,13.841764876954395,9.1055131631791042,7.9629963023999784,12.69924801617527,7.5336869365314572,5.7125843038956363,10.234181334736668]
["North West","Rochdale",137156,1830,1559,2456,1412,1257,1686,1373,1062,1879,13.342471346495961,11.366619032342735,17.906617282510425,10.294846743853714,9.1647467117734553,12.292571961853657,10.010498993846424,7.7430079617370007,13.699728775992302]
["North West","Salford",161735,1399,1013,1756,1207,939,1471,1109,772,1702,8.649952082109623,6.263331993693388,10.857266516214796,7.4628249914984384,5.8057934275203262,9.095124741088819,6.8568955389989803,4.7732401768324726,10.523387021980401]
["North West","Sefton",168662,1686,1536,1978,1615,1441,2218,1427,1224,1759,9.9963240089646757,9.106971339127961,11.727597206246813,9.5753637452419635,8.5437146482313739,13.150561477985557,8.4607083990466148,7.2571177858675924,10.429142308285209]
["North West","St. Helens",112309,1386,1209,1631,1138,1019,1399,704,414,1002,12.340952194392257,10.764943147922249,14.522433642895939,10.132758728151796,9.0731820245928656,12.456704271251636,6.2684201622309876,3.6862584476756091,8.9218139240844447]
["North West","Stockport",179931,1518,1307,2033,1243,1056,1551,844,412,1320,8.4365673508178123,7.2638956044261409,11.298775641773791,6.9082037003073395,5.868916417960218,8.6199709888790697,4.6906869855666891,2.2897666327647821,7.3361455224502725]
["North West","Tameside",142298,1396,1250,2003,1198,1104,1327,812,680,1009,9.8103978973703061,8.7843820714275669,14.076093831255534,8.418951777256181,7.7583662454848277,9.3255000070275056,5.7063345935993484,4.7787038468565965,7.0907532080563325]
["North West","Trafford",148236,858,512,1174,732,483,988,559,181,975,5.7880676758682101,3.4539518065786989,7.9198035564910008,4.9380717234679841,3.2583178175342025,6.6650476267573326,3.771013788823228,1.221025931622548,6.5773496316684206]
["North West","Warrington",133493,947,814,1142,802,705,950,869,599,1367,7.0940049290974061,6.0976980066370521,8.5547556800731126,6.0078056527308554,5.2811757919890931,7.1164780175739555,6.5097046287071239,4.4871266658176836,10.240237315814314]
["North West","Wigan",206516,2155,1665,2629,1867,1527,2226,813,280,1332,10.435026826008638,8.0623293110461169,12.730248503747895,9.0404617559898508,7.394100214995448,10.778825853686882,3.9367409789072028,1.3558271514071547,6.4498634488368936]
["North West","Wirral",199069,2837,2565,3404,2662,2281,3020,1188,1017,1474,14.251339987642476,12.884979579944643,17.09959863163024,13.372247813572178,11.458338566024846,15.170619232527416,5.9677800159743608,5.1087813773113844,7.4044677975978184]
["South East","Bracknell Forest",79029,372,183,544,236,188,343,291,187,542,4.7071328246593023,2.315605663743689,6.8835490769211303,2.9862455554290199,2.3788735780536259,4.3401789216616677,3.6821926128383251,2.3662199951916385,6.8582419111971555]
["South East","Brighton and Hove",200682,2128,1889,2489,2098,1757,3598,1210,921,1680,10.603840902522398,9.4129020041657956,12.402706769914591,10.454350664234958,8.7551449557010592,17.92886257860695,6.0294396109267403,4.5893503154244026,8.371453344096631]
["South East","Buckinghamshire",328687,1647,940,2339,1394,763,1914,1362,956,2044,5.0108461849723289,2.8598636392677532,7.1161926087736971,4.2411169288715405,2.3213574008098892,5.8231691548494462,4.1437598688113617,2.9085421692978426,6.2186822113439231]
["South East","East Sussex",320514,2296,1547,2980,1981,1434,2506,1232,992,1564,7.1634936383434109,4.826622238030164,9.2975657849579125,6.1806972550341008,4.4740635354461897,7.8186912272162834,3.8438258547208548,3.095028610294714,4.8796620428436821]
["South East","Hampshire",839762,3215,2955,3633,2828,2616,3266,1775,1430,2155,3.8284656843248444,3.5188541515334104,4.3262257639664572,3.3676208259006719,3.1151683453168872,3.8891971772954719,2.1136941180953652,1.7028634303528858,2.5662032814059219]
["South East","Isle of Wight",82208,544,352,733,481,342,610,238,51,459,6.6173608407940829,4.2818217205138183,8.9164071623199685,5.8510120669521219,4.1601790579992217,7.4202024133904239,2.8950953678474112,0.62037757882444522,5.5833982094200083]
["South East","Kent",945347,5198,3163,7156,4401,2759,6086,3398,2780,4206,5.4985100709051808,3.3458613609605785,7.569707208041069,4.6554334017032897,2.918505056873296,6.4378476897900985,3.5944473299222404,2.9407191221847642,4.4491599380968045]
["South East","Medway",180295,1259,831,1648,1208,1038,1516,848,368,1360,6.9830000831969832,4.6091128428408998,9.140575168473891,6.700130341939599,5.7572312044149863,8.4084417205136024,4.7034027565933609,2.0410993094650434,7.5431931001968993]
["South East","Milton Keynes",171231,1006,608,1427,846,550,1146,774,319,1204,5.8751043911441263,3.5507589163177227,8.3337713381338663,4.940694150007884,3.2120352039058346,6.6927133521383393,4.5202095414965751,1.8629804182653842,7.0314370645502278]
["South East","Oxfordshire",439057,2933,1974,3948,2811,2384,4128,2416,1146,3521,6.6802260298776694,4.4959993804904599,8.9919987609809198,6.4023577804248655,5.4298189073400485,9.4019683093539115,5.5027023826063592,2.610139457974705,8.0194598878961045]
["South East","Portsmouth",142936,1427,1253,1795,1315,1043,1611,845,456,1233,9.9834891140090676,8.7661610790843447,12.558067946493535,9.1999216432529245,7.2969720714165778,11.270778530251302,5.9117367213298255,3.1902389880785806,8.626238316449319]
["South East","Reading",110593,1332,1113,1904,1157,999,1601,881,595,1171,12.044161927065907,10.063928096714982,17.216279511361478,10.461783295506949,9.0331214452994306,14.476503937862251,7.9661461394482469,5.3800873473004627,10.588373586031667]
["South East","Slough",96458,887,688,1103,758,593,924,689,437,940,9.1957121234112265,7.1326380393539148,11.435028717161874,7.8583424910323663,6.1477534263617333,9.579298762155549,7.1430052458064646,4.5304692197640426,9.7451740653963377]
["South East","Southampton",171395,1483,1105,1872,1273,995,1592,1115,666,1559,8.6525277866915609,6.4470958896117159,10.922138918871612,7.4272878438694239,5.8053035386096443,9.2884856617754306,6.505440648793722,3.8857609615216311,9.0959479564748094]
["South East","Surrey",734879,2966,2664,3468,2409,2183,2824,2243,1737,2741,4.0360385859440804,3.6250865788789719,4.7191442400721755,3.2780906788736646,2.9705570576924911,3.8428094965293607,3.0522031518113866,2.3636544247420326,3.7298657329982214]
["South East","West Berkshire",99340,524,438,716,488,406,643,337,245,510,5.2748137708878602,4.4091000603986306,7.2075699617475335,4.9124219851016715,4.0869740285886857,6.4727199516810954,3.3923897724984902,2.4662774310448961,5.1338836319710088]
["South East","West Sussex",504057,2646,1524,3732,2230,1336,3095,1927,573,3259,5.2494063171427046,3.0234675840232352,7.403924556151388,4.4241028296402982,2.6504938925558021,6.1401785909133295,3.8229803375411908,1.1367761979299962,6.4655386196402391]
["South East","Windsor and Maidenhead",93244,531,428,687,448,359,701,383,251,647,5.6947363905452368,4.5901076744884381,7.3677662905924235,4.8045986873150008,3.8501136802367979,7.5179099995710175,4.1075028956286737,2.6918622109733601,6.938784264939299]
["South East","Wokingham",101119,340,253,644,277,203,468,162,102,337,3.3623750234871781,2.5020025910066357,6.368733868016891,2.7393467103116129,2.007535675787933,4.6282103264470571,1.6020728053085969,1.0087125070461536,3.3327070085740562]
["South West","Bath and North East Somerset",119089,1007,809,1608,984,782,1599,449,322,750,8.4558607428058004,6.7932386702382255,13.502506528730613,8.2627278757903753,6.5665174785244647,13.42693279815936,3.7702894473880879,2.7038601382159562,6.297810880937786]
["South West","Bournemouth",128164,1854,1638,2439,1510,1393,1873,1114,889,1500,14.46584064167785,12.780499984394993,19.030304921818921,11.781779594894042,10.868886738865827,14.614088199494397,8.6919883898754708,6.9364252052058299,11.70375456446428]
["South West","Bristol, City of",305261,4709,4006,5420,4116,3598,4670,3710,2824,4584,15.426143529635295,13.123196215697387,17.755297925381885,13.483543590566761,11.786635043454616,15.298384005817972,12.153534188776161,9.2510998784646574,15.016657876374644]
["South West","Cornwall (UA) and \nIsles of Scilly (UA)",331779,2111,1843,2665,2093,1824,2608,783,71,1604,6.3626691261351676,5.5549025104060235,8.0324553392469085,6.3084161444817184,5.4976354742162705,7.8606542306776506,2.3600047019250767,0.21399787207749738,4.8345434762296593]
["South West","Devon",462711,2147,1949,2471,2113,1918,2414,996,518,1229,4.6400452982531215,4.2121324109433322,5.3402663865782314,4.5665653075029553,4.1451359487887691,5.2170793432617772,2.152531493740153,1.1194892708407624,2.6560855479986429]
["South West","Dorset",240957,1647,1415,2340,1389,1204,1910,823,205,1487,6.8352444627049636,5.8724170702656489,9.7112762858103316,5.7645140004233113,4.9967421573143751,7.9267255153409115,3.4155471723170523,0.85077420452611885,6.171225571367505]
["South West","Gloucestershire",385736,2829,1981,3658,2418,1743,3070,1938,900,2880,7.3340315656303794,5.1356368085944792,9.4831698363647678,6.2685359935292535,4.5186345065018569,7.9588112076653461,5.0241616027542157,2.3332019827031956,7.4662463446502265]
["West Midlands","Staffordshire",545413,3446,3143,3939,2679,2506,2965,1991,568,3325,6.3181478989316355,5.7626055851254003,7.2220500794810532,4.9118741210788892,4.5946832950443062,5.4362473941765233,3.6504447088719925,1.0414126542638331,6.0962976680057128]
["South West","Plymouth",172792,2108,1925,2530,2019,1841,2404,686,435,1198,12.199638872170009,11.140562063058475,14.641881568591138,11.684568730033799,10.654428445761377,13.912681142645493,3.9700912079262927,2.5174776610028244,6.9331913514514563]
["South West","Poole",92591,558,421,1118,432,343,869,446,225,1033,6.0265036558628813,4.5468782063051485,12.074607683252152,4.6656802497002943,3.7044637167759285,9.3853614282165641,4.8168828503850269,2.4300417967189034,11.156591893380567]
["South West","Somerset",328146,1929,1730,2325,1647,1496,1960,718,534,1099,5.8784809200782577,5.2720435415942903,7.0852608290212284,5.019107348558264,4.5589463226734441,5.9729510644652075,2.1880504409622543,1.627324422665521,3.3491189897179914]
["South West","South Gloucestershire",174887,1043,655,1429,888,603,1209,931,548,1173,5.9638509437522513,3.7452755207648369,8.170990410951072,5.0775643701361455,3.4479406702613686,6.9130352742056305,5.3234374195909364,3.1334518860750085,6.7071880700109219]
["South West","Swindon",142703,1153,828,1492,912,822,1099,919,503,1335,8.0797180157389832,5.8022606392297291,10.455281248467097,6.39089577654289,5.7602152722787885,7.7013097131805219,6.4399487046523198,3.5248032627204755,9.3550941465841646]
["South West","Torbay",78628,775,672,946,740,654,1024,232,46,437,9.8565396550847026,8.5465737396347361,12.031337437045327,9.4114056061453937,8.3176476573230911,13.023350460395786,2.9506028386834204,0.58503332146309206,5.5578165538993742]
["South West","Wiltshire",300610,1485,1236,3105,1141,970,1491,978,251,1764,4.9399554239712584,4.1116396660124419,10.328997704667177,3.7956155816506438,3.2267722297994079,4.9599148398256876,3.2533847842719803,0.83496889657696016,5.8680682612022217]
["West Midlands","Birmingham",720045,9705,8184,11470,8234,6933,9398,6689,4692,8743,13.478324271399705,11.365956294398266,15.929559958058178,11.435396398836183,9.6285648813615818,13.051962030150893,9.289697171704546,6.516259400454139,12.14229666201418]
["West Midlands","Coventry",225702,1874,1698,2157,1805,1605,2198,1234,1064,1490,8.3029835801189176,7.5231943004492647,9.556849296860463,7.9972707375211556,7.1111465560783689,9.7385047540562333,5.4673861995019983,4.7141806452756292,6.6016251517487659]
["West Midlands","Dudley",196837,2010,1565,2450,1595,1460,1846,1049,896,1244,10.211494790105519,7.9507409684154915,12.44684688346195,8.1031513384170655,7.4173046734099781,9.3783181007635772,5.3292826043884025,4.5519897173803709,6.3199500093986396]
["West Midlands","Herefordshire, County of",114416,942,776,1468,830,711,1281,393,113,706,8.2331142497552783,6.7822682142357715,12.830373374353236,7.2542301775975391,6.2141658509299402,11.195986575304152,3.434834288910642,0.98762410851629157,6.170465669137184]
["West Midlands","Sandwell",202511,2151,1728,2624,1807,1458,2157,1766,1469,2177,10.621645243962057,8.5328698194172166,12.957320836892812,8.922972085466963,7.1996089101332768,10.651273264168365,8.7205139473905131,7.2539269471781775,10.750033331522731]
["West Midlands","Shropshire",190920,1202,1059,1460,1111,995,1484,556,452,722,{"$f":"D136/$C136*1000","v":6.2958307144353656},{"$f":"E136/$C136*1000","v":5.5468258956631056},{"$f":"F136/$C136*1000","v":7.6471820657867173},{"$f":"G136/$C136*1000","v":5.8191912843075633},{"$f":"H136/$C136*1000","v":5.2116069557930027},{"$f":"I136/$C136*1000","v":7.7728891682380059},{"$f":"J136/$C136*1000","v":2.9122145401215169},{"$f":"K136/$C136*1000","v":2.3674837628326002},{"$f":"L136/$C136*1000","v":3.7816886654095954}]
["West Midlands","Solihull",129403,961,678,1261,936,736,1310,377,315,463,7.4264120615441689,5.2394457624630029,9.7447508944924,7.2332171587984826,5.687657936832994,10.123412903873945,2.9133791334049444,2.434255774595643,3.5779695988501041]
["West Midlands","Staffordshire",545413,3446,3143,3939,2679,2506,2965,1991,568,3325,6.3181478989316355,5.7626055851254003,7.2220500794810532,4.9118741210788892,4.5946832950443062,5.4362473941765233,3.6504447088719925,1.0414126542638331,6.0962976680057128]
["West Midlands","Stoke-on-Trent",162135,2654,2282,3036,2510,2258,2991,1434,1100,1990,16.369075153421534,14.07469084404971,18.72513646035711,15.480926388503407,13.926666049896692,18.447589971320195,8.8444814506429825,6.7844697320134459,12.273722515187961]
["West Midlands","Telford and Wrekin",109678,929,824,1202,765,691,1002,644,361,931,8.4702492751508967,7.512901402286694,10.959353744597822,6.9749630737249033,6.3002607633253707,9.1358339867612468,5.8717336202337753,3.2914531628950203,8.4884844727292617]
["West Midlands","Walsall",171470,1906,1740,2227,1627,1491,1879,1376,1186,1630,11.115647051962442,10.147547675978304,12.987694640461887,9.4885402694348855,8.6953986120020996,10.958185105266226,8.0247273575552569,6.9166618067300405,9.506036041290022]
["West Midlands","Warwickshire",348267,2100,1843,2574,2085,1766,2552,1291,1024,1571,6.0298564032767965,5.2919168339233984,7.3908811343021306,5.986786000396247,5.0708220991365813,7.3277112100773261,3.7069260079192112,2.9402728366454474,4.5109068616894508]
["West Midlands","Wolverhampton",162435,2172,1951,2602,1904,1708,2247,1679,1264,2132,13.371502447132698,12.010958229445624,16.018715178379043,11.721611721611721,10.514975220857574,13.833225597931479,10.336442269215379,7.78157416812879,13.125250100040017]
["West Midlands","Worcestershire",358670,2770,1906,3589,2382,1752,2996,1451,452,2383,7.7229765522625247,5.3140770067192689,10.006412579808739,6.6412022193102294,4.8847129673516045,8.3530822204254598,4.0455014358602623,1.2602113363258707,6.6439902974879415]
["Yorkshire and the Humber","Barnsley",152786,1851,1608,2247,1534,1355,1930,782,528,1225,12.114984357205504,10.524524498317907,14.706844867985286,10.040186928121686,8.8686136164308262,12.63204743890147,5.118269998560077,3.4558140143730447,8.0177503174374625]
["Yorkshire and the Humber","Bradford",335998,4785,3963,5579,4104,3512,4698,3308,2354,4213,14.241156197358317,11.794713063768237,16.604265501580368,12.214358418800112,10.45244316930458,13.982226084679075,9.8452966981946322,7.0059940832981145,12.538765111697092]
["Yorkshire and the Humber","Calderdale",133093,1556,1248,1848,1352,1181,1710,946,608,1292,11.691073159369763,9.3769018656127674,13.885027762541982,10.15831035441383,8.8734944737890054,12.848158806248263,7.107811830825062,4.5682342422216049,9.7074977647209089]
["Yorkshire and the Humber","Doncaster",194486,2337,1890,2808,2116,1777,2479,842,337,1353,12.016289090217292,9.7179231409972946,14.438057238053124,10.879960511296444,9.1369044558477217,12.746418765361003,4.3293604681056728,1.7327725388974013,6.956798946967905]
["Yorkshire and the Humber","East Riding of Yorkshire",205162,945,817,1225,859,751,1027,545,88,1101,4.6061161423655452,3.9822189294313763,5.9708912956590403,4.1869352024254001,3.6605219290121953,5.0058002944014977,2.6564373519462672,0.42892933389224125,5.3664908706290637]
["Yorkshire and the Humber","Kingston upon Hull, City of",172910,3309,2832,3731,2855,2499,3186,902,591,1429,19.137123358972875,16.378462784107338,21.57769938118096,16.511479960673181,14.45260540165404,18.425770632120756,5.2165866635822109,3.4179631021918917,8.2644150135908863]
["Yorkshire and the Humber","Kirklees",277251,2487,2227,3022,2338,1875,2820,1776,1016,2555,8.9702111083458682,8.0324327053824884,10.899870514443592,8.4327919466476242,6.762825021370527,10.171288832141274,6.4057478602421627,3.6645494515799761,9.2154762291209043]
["Yorkshire and the Humber","Leeds",513431,5517,4337,6703,4739,3888,5655,3274,1907,4623,10.745358188344685,8.447094156761084,13.055308308224474,9.2300620726056675,7.5725852159296965,11.014138219157005,6.3767088469531448,3.7142283968050234,9.0041310322127011]
["Yorkshire and the Humber","North East Lincolnshire",100541,1469,1222,1693,1300,1114,1482,693,472,1125,14.610954734884276,12.154245531673645,16.838901542654241,12.930048437950687,11.080056892213127,14.740255219263783,6.8927104365383283,4.6946022020867106,11.189464994380403]
["Yorkshire and the Humber","North Lincolnshire",106441,1321,1066,1558,1166,979,1340,579,481,728,12.410631241720765,10.014937852895031,14.637216861923505,10.954425456356104,9.1975836378838984,12.589133886378368,5.4396332240396088,4.5189353726477579,6.8394697531966067]
["Yorkshire and the Humber","North Yorkshire",368824,1953,1735,2295,1798,1622,2178,1099,254,2042,5.2952085547578251,4.7041407283690866,6.2224800989089655,4.8749539075548229,4.397761533956575,5.905255623278312,2.9797410146845107,0.68867535735201613,5.5365160618614837]
["Yorkshire and the Humber","Rotherham",164360,1904,1699,2382,1614,1466,1916,830,597,1246,11.584327086882453,10.337064979313702,14.492577269408615,9.8199075200778783,8.919445120467266,11.657337551715747,5.0498904843027503,3.6322706254563157,7.5809199318568989]
["Yorkshire and the Humber","Sheffield",375998,3668,2812,4601,3245,2553,3861,2546,2018,3207,9.7553710392076542,7.4787631849105578,12.236767216846898,8.6303650551332716,6.7899297336687958,10.268671641870435,6.7713126133649642,5.36704982473311,8.5293006877696165]
["Yorkshire and the Humber","Wakefield",212883,2634,2408,3019,2343,2167,2638,984,457,1547,12.372993616211721,11.311377611176091,14.181498757533481,11.006045574329562,10.179300366868185,12.391783280017663,4.6222572962613269,2.1467190898286854,7.2669024769474317]
["Yorkshire and the Humber","York",137590,926,835,1213,858,780,1073,305,178,576,6.73014027182208,6.068754996729413,8.8160476778835672,6.2359183080165703,5.6690166436514282,7.7985318700486959,2.2167308670688279,1.2936986699614799,4.1863507522349002]
["East of England","East of England",3803990,25910,23146,28708,21827,20086,23861,17408,14005,20606,6.8112692199506304,6.0846637346575569,7.5468126887820421,5.7379225497438222,5.2802452162071933,6.2726242708314164,4.5762475716287367,3.6816605721886755,5.4169437879699993]
["East Midlands","East Midlands",2977879,25057,23108,27064,22163,20635,24262,12331,10451,14255,8.4143781530411399,7.7598854755347677,9.088347780416866,7.4425455164565113,6.929428630243204,8.1474096160387983,4.1408667041206177,3.5095448807691647,4.7869641446143385]
["London","London",5915778,52487,50955,55550,40750,39407,42995,39226,37364,41940,8.8723748592323783,8.6134063854323131,9.3901427673587481,6.8883585557132134,6.6613385424537563,7.2678521743040392,6.6307423977032265,6.3159908975624175,7.0895155294874153]
["North East","North East",1692377,17675,17116,19120,15414,14945,16643,6331,4965,8002,10.443890457031737,10.113585802690535,11.297719125230371,9.1078997173797571,8.8307747032723789,9.8340972490172121,3.7408922480038433,2.9337434862326774,4.7282609016785271]
["North West","North West",4592973,48814,46661,52097,42647,41029,45239,28685,25980,31979,10.627974516723699,10.159214957283659,11.342762084601848,9.285271217575195,8.9329939453160296,9.8496115696739341,6.245410108006296,5.6564669550637463,6.9625926387984434]
["South East","South East",5640833,32734,30175,35974,28639,26645,32162,22126,20015,24583,5.8030436284853666,5.3493872270283482,6.3774268800370439,5.0770870188853312,4.7235931288871695,5.7016401655571078,3.9224703159976553,3.5482348085823494,4.3580442817576763]
["South West","South West",3389047,26622,25586,29474,23545,22834,25830,15380,13116,17255,7.8553056360681932,7.549614980258462,8.6968401441467176,6.9473807828572456,6.7375872922387918,7.6216116212020664,4.5381489250517921,3.8701145189193302,5.0914018011553104]
["West Midlands","West Midlands",3637902,34822,33090,37580,30270,28991,32519,21930,19184,24835,9.5720005651609075,9.0959019786679249,10.330129838571793,8.3207299152093714,7.9691536495485584,8.9389433800030886,6.0281997700872649,5.2733691012017365,6.8267369489337533]
["Yorkshire and the Humber","Yorkshire and the Humber",3451754,36662,34971,38800,32221,30834,34026,19411,17130,21989,10.621266753076842,10.131370891436644,11.24066199387326,9.3346744872317089,8.9328497917290743,9.8575970361734946,5.6235177825534501,4.9626943287383742,6.3703844480226577]
["ENGLAND","ENGLAND",35102533,300783,297986,311128,257476,255440,266643,182828,176675,190782,8.5686978771588933,8.4890170176608049,8.8634059542084902,7.334969245666688,7.2769677333541711,7.5961184909362522,5.208399063395226,5.0331125676884909,5.4349923978420591]

{"sheet":"2014-15 Prev Estimates by Age","index":5,"n_rows":167,"n_cols":41,"rows_kept":167,"cut":false,"hidden":false,"merged":[[5,39,7,39],[5,40,7,40],[5,33,7,33],[5,34,7,34],[5,35,7,35],[5,36,7,36],[5,37,7,37],[5,38,7,38],[5,32,7,32],[5,21,7,21],[5,22,7,22],[5,23,7,23],[5,24,7,24],[5,25,7,25],[5,26,7,26],[5,27,7,27],[5,28,7,28],[5,29,7,29],[5,30,7,30],[5,31,7,31],[5,20,7,20],[5,9,7,9],[5,10,7,10],[5,11,7,11],[5,12,7,12],[5,13,7,13],[5,14,7,14],[5,15,7,15],[5,16,7,16],[5,17,7,17],[5,18,7,18],[5,19,7,19],[3,23,3,40],[4,5,4,10],[4,11,4,16],[4,17,4,22],[4,23,4,28],[4,29,4,34],[4,35,4,40],[3,5,3,22],[5,5,7,5],[5,6,7,6],[5,7,7,7],[5,8,7,8],[3,0,7,0],[3,1,7,1],[3,2,7,2],[3,3,7,3],[3,4,7,4]]}
["National and local prevalence estimates by age band and rates per 1,000 population  with 95% confidence intervals (CI) - 2014/15"]
[]
[]
["Region","Local authority","15-24 population","25-34 population","35-64 population","Number of users",null,null,null,null,null,null,null,null,null,null,null,null,null,null,null,null,null,"Rate per thousand of the population"]
[null,null,null,null,null,"15-24",null,null,null,null,null,"25-34",null,null,null,null,null,"35-64",null,null,null,null,null,"15-24",null,null,null,null,null,"25-34",null,null,null,null,null,"35-64"]
[null,null,null,null,null,"OCU","Lower bound  95% CI","Upper bound  95% CI","Opiate users","Lower bound  95% CI","Upper bound   95% CI","OCU","Lower bound  95% CI","Upper bound  95% CI","Opiate users","Lower bound  95% CI","Upper bound   95% CI","OCU","Lower bound  95% CI","Upper bound  95% CI","Opiate users","Lower bound  95% CI","Upper bound   95% CI","OCU","Lower bound  95% CI","Upper bound  95% CI","Opiate users","Lower bound  95% CI","Upper bound   95% CI","OCU","Lower bound  95% CI","Upper bound  95% CI","Opiate users","Lower bound  95% CI","Upper bound   95% CI","OCU","Lower bound  95% CI","Upper bound  95% CI","Opiate users","Lower bound  95% CI","Upper bound   95% CI"]
[]
[]
["East Midlands","Derby",35502,36132,91265,294,189,491,190,128,323,941,799,1183,803,682,991,1082,910,1378,996,864,1204,8.2812235930370122,5.3236437383809365,13.830206748915554,5.3518111655681366,3.6054306799616924,9.0980789814658323,26.043396435292816,22.113362116683273,32.741060555740063,22.22406730875678,18.875235248533155,27.42721133621167,11.855585383224675,9.9709636772037467,15.098887854051389,10.913274530214212,9.4669369418725697,13.192351942146496]
["East Midlands","Derbyshire",88262,85905,320442,300,179,529,177,107,289,1307,847,1973,1134,727,1748,2436,1549,3245,2170,1486,2817,3.3989712447032696,2.0280528426729512,5.9935192948267657,2.0053930343749293,1.2122997439441663,3.2743422990641498,15.214481112857227,9.859728770153076,22.967231243815842,13.20062860136197,8.4628368546650368,20.348058902275771,7.6019997378620783,4.8339481091742034,10.126637581840084,6.7718963182104721,4.6373446676777696,8.7909824554833644]
["East Midlands","Leicester",60114,55359,114277,345,102,563,115,79,190,921,655,1268,792,609,1057,1532,1207,1830,1391,1068,1687,5.7390957181355429,1.6967761253618125,9.3655388095951029,1.9130319060451808,1.3141697441527764,3.1606614099876902,16.636861214978595,11.831861124659044,22.905038024530789,14.306616810274752,11.000921259415813,19.093552990480319,13.40602220919345,10.562055356720951,16.013721046229776,12.172178128582305,9.345712610586558,14.762375631141875]
["East Midlands","Leicestershire",85921,74209,266765,407,97,687,244,48,557,928,485,1787,833,479,1365,1365,856,1897,1208,652,1791,4.736909486621431,1.1289440299810292,7.9957169958450205,2.8398179723234134,0.55865271586690102,6.482699223705497,12.505221738603135,6.5355954129553018,24.080637119486855,11.225053564931477,6.4547426861970916,18.393995337492758,5.1168631567109628,3.208816748823871,7.1111277716342096,4.5283301782467715,2.4440987385901449,6.7137742957284505]
["East Midlands","Lincolnshire",86077,81039,284580,206,138,340,251,83,561,1179,853,1658,1062,683,1589,1715,1252,2202,1616,1120,2142,2.3932060829257527,1.6032157254551158,3.949951787353184,2.9159938194872033,0.96425293632445364,6.5174204491327536,14.548550697812164,10.52579622157233,20.459285035600143,13.104801391922408,8.4280408198521695,19.607843137254903,6.0264249068803153,4.3994658795417809,7.7377187434113432,5.678543818961276,3.9356244289830626,7.5268817204301079]
["East Midlands","Northamptonshire",81586,90023,286402,360,115,589,177,43,423,1159,785,1556,672,451,929,1896,1313,2475,2059,1477,2675,4.4125217561836587,1.4095555610031132,7.2193758733115976,2.1694898634569655,0.52705120976638153,5.1847130635157992,12.874487630938759,8.7199937793674955,17.284471746109329,7.4647590060317919,5.0098308210124083,10.319584994945735,6.6200655023358772,4.5844651922821766,8.6416994294732579,7.1891956061759341,5.1570868918513142,9.3400185752892781]
["East Midlands","Nottingham",73083,49015,100203,324,89,665,188,54,444,630,450,922,637,435,880,1746,1489,2204,1575,1296,2008,4.4333155453388615,1.2177934677011069,9.0992433260813055,2.5724176621102033,0.73888592422314359,6.0752842658347355,12.853208201570947,9.1808630011221055,18.81056819341018,12.996021626032848,8.8748342344180351,17.953687646638784,17.424628005149547,14.859834535892139,21.995349440635511,15.718092272686446,12.933744498667705,20.03932018003453]
["East Midlands","Nottinghamshire",92078,93339,322992,941,316,2421,197,135,356,1123,617,1658,1502,1232,2043,1853,852,2471,2119,1778,2892,10.219596429114446,3.4318729772584113,26.292925563109538,2.1394904320250223,1.4661482656009035,3.8662872781771975,12.03141237853416,6.6103129452854645,17.763207233846515,16.091880135848896,13.199198620083781,21.887956802622696,5.7369841977510276,2.6378362312379253,7.6503442809729032,6.5605340070342297,5.5047803041561405,8.953782137018873]
["East Midlands","Rutland",4693,3886,14730,15,1,28,10,0,32,23,3,53,19,3,46,29,4,56,26,5,61,3.1962497336458555,0.21308331557639038,5.9663328361389301,2.1308331557639035,0,6.818666098444492,5.9186824498198662,0.77200205867215643,13.638703036541431,4.8893463715903245,0.77200205867215643,11.837364899639732,1.9687712152070604,0.27155465037338766,3.8017651052274268,1.7651052274270196,0.33944331296673458,4.1412084181941617]
["East of England","Bedfordshire\n(Bedford UA / Central Bedfordshire UA)",49396,54868,175052,120,63,258,146,43,332,761,538,984,601,378,956,1314,906,1704,1082,685,1444,2.4293465057899426,1.2754069155397199,5.2230949874483761,2.9557049153777633,0.87051583124139609,6.7211919993521745,13.869650798279507,9.8053510242764457,17.933950572282569,10.953561274331122,6.8892615003280602,17.423634905591602,7.5063409729680322,5.1756049630966796,9.7342503941685905,6.1810204967666751,3.9131229577496973,8.2489774467015522]
["East of England","Cambridgeshire",82458,84559,249590,353,162,840,191,41,510,634,441,812,593,290,984,1240,873,1512,1170,815,1655,4.2809672803124013,1.9646365422396856,10.187004293094667,2.3163307380727156,0.49722282859152539,6.184966892236047,7.4977234830118613,5.2152934637353798,9.6027625681476838,7.0128549296940594,3.4295580600527442,11.636845279627243,4.9681477623302213,3.4977362875115188,6.0579350134220125,4.6876878080051281,3.2653551824992988,6.630874634400417]
["East of England","Essex",167106,166437,563278,785,268,1224,504,109,1249,1686,1044,2378,998,525,1736,2992,1881,4100,2990,1706,4239,4.6976170813734992,1.6037724558064941,7.3246921115938388,3.0160496930092275,0.65228058836905911,7.4742977511280264,10.129959083617225,6.2726437030227657,14.287688434662966,5.9962628502075859,3.1543466897384596,10.430373054068506,5.3117643508178913,3.3393812646686007,7.2788214700378857,5.3082137061983605,3.0286998604596667,7.5255912710952675]
["East of England","Hertfordshire",132353,151329,460495,702,190,1192,264,162,457,1138,526,2306,958,753,1228,2386,1410,3455,2196,1825,2709,5.3039976426677145,1.4355549175311477,9.0062182194585692,1.9946657801485421,1.2239994560002418,3.4528873542722871,7.5200391200629095,3.4758704544403254,15.238321802166141,6.330577747820973,4.9759134072121007,8.1147698061838778,5.1813809053301343,3.0619224964440441,7.5027959044072139,4.7687814199937026,3.9631266354683548,5.8828000304020671]
["East of England","Luton",29070,36840,72957,196,70,375,85,37,175,632,468,819,418,309,566,887,680,1113,908,705,1105,6.74234606123151,2.4079807361541108,12.899896800825593,2.9239766081871346,1.2727898176814585,6.0199518403852768,17.155266015200869,12.703583061889251,22.23127035830619,11.346362649294246,8.3876221498371333,15.363735070575462,12.157846402675549,9.3205586852529567,15.255561495127267,12.445687185602479,9.6632262839754919,15.145907863536056]
["East of England","Norfolk",102071,100992,331539,232,177,328,221,148,381,1181,998,1404,971,698,1407,2568,2281,2923,2339,1838,2796,2.2729276679958068,1.7340870570485249,3.2134494616492439,2.1651595458063504,1.4499710985490493,3.7326958685620792,11.693995564005069,9.881970849176172,13.902091254752852,9.6146229404309249,6.9114385297845375,13.931796577946768,7.7456950765973236,6.880035229641158,8.8164589987904893,7.0549769408727174,5.5438425042001089,8.4333969759213847]
["East of England","Peterborough",22763,30167,70562,104,59,203,81,38,167,802,608,1049,479,355,625,631,453,803,792,611,977,4.5688178183894914,2.5919254931248079,8.9179809339717959,3.5584061854764308,1.669375741334622,7.3364670737600495,26.585341598435377,20.154473431232805,34.773096429873704,15.878277588092949,11.767825769880996,20.718003115987667,8.9424902922252762,6.4198860576514267,11.380062923386525,11.224171650463422,8.6590516141832712,13.845979422351974]
["East of England","Southend-on-Sea",20262,22796,69415,93,28,208,50,28,123,262,208,340,240,170,365,678,571,829,641,521,835,4.5898726680485638,1.3818971473694601,10.265521666173132,2.4676734774454645,1.3818971473694601,6.0704767545158429,11.493244428847166,9.1244077908404986,14.914897350412353,10.52816283558519,7.4574486752061766,16.011580979119145,9.7673413527335597,8.2258877764172009,11.942663689404307,9.2343153497082771,7.5055823669235755,12.029100338543543]
["East of England","Suffolk",80912,85666,284058,212,106,394,254,64,621,833,439,1431,671,362,1082,1806,1088,2571,1466,903,2071,2.6201305121613605,1.3100652560806803,4.8694878386395093,3.1392129721178565,0.79098279612418432,7.6750049436424757,9.7238110802418696,5.1245534984708057,16.704410151051761,7.8327457801228029,4.2257138187845822,12.630448485980436,6.3578564940962758,3.8302036907955417,9.0509684641868908,5.1609178407226697,3.1789282470481379,7.2907645621668813]
["East of England","Thurrock",19647,23392,63960,163,37,560,47,10,114,139,40,264,146,65,256,380,111,628,325,210,535,8.2964320252455845,1.8832391713747645,28.503079350536979,2.392222731205782,0.50898355983101751,5.8024125820735994,5.9422024623803011,1.7099863201094392,11.285909712722297,6.2414500683994527,2.7787277701778388,10.943912448700411,5.941213258286429,1.7354596622889307,9.8186366479049401,5.0813008130081299,3.2833020637898689,8.3646028767979992]
["London","Barking and Dagenham",25945,31949,69747,114,75,224,82,53,157,446,347,585,333,263,451,590,465,739,446,370,574,4.3939101946425128,2.8907303912121796,8.6336481017537103,3.1605318943919829,2.0427828097899403,6.0512622856041629,13.959748348931109,10.861059814078688,18.31043225140067,10.422861435412688,8.2318695420826948,14.116247769883252,8.4591451962091568,6.6669534173512837,10.59543779660774,6.3945402669648876,5.3048876654193009,8.2297446485153483]
["London","Barnet",43452,63758,141057,334,123,971,112,32,291,352,207,586,327,210,550,982,611,1556,951,691,1299,7.6866427322102551,2.8307097486882076,22.346497284359753,2.5775568443339778,0.7364448126668508,6.6970450151891745,5.52087581166285,3.2466514006085512,9.1910034819159954,5.128768154584523,3.2937043194579503,8.6263684557232025,6.9617246928546619,4.3315822681610978,11.031001651814515,6.7419553797401051,4.8987288826502757,9.2090431527680305]
["London","Bexley",30587,31144,92033,123,31,347,71,16,188,187,120,403,198,88,336,414,286,900,272,174,457,4.0213162454637592,1.0135024683689149,11.344688920129467,2.3212475888449342,0.52309804819040773,6.1464020662372905,6.0043668122270741,3.8530696121243255,12.93989211405086,6.3575648600051373,2.8255843822245055,10.788594913948112,4.4983864483391827,3.107580976388904,9.7791009746503974,2.9554616278943424,1.89062618843241,4.9656101615724797]
["London","Brent",39590,63474,119142,235,136,431,185,94,351,578,391,834,365,227,541,1077,758,1468,860,599,1141,5.935842384440515,3.435210911846426,10.886587522101541,4.6728971962616823,2.374336953776206,8.8658752210154077,9.1060906827992572,6.1600025207171436,13.139238113243218,5.750385984812679,3.5762674480889811,8.5231748432429022,9.0396333786574008,6.3621560826576689,12.321431569052056,7.2182773497171446,5.0276141075355456,9.5768075070084429]
["London","Bromley",33842,41109,130061,248,101,610,87,34,341,274,151,481,167,90,283,699,427,1011,616,387,854,7.3281720938478809,2.9844571833815969,18.024939424383902,2.5707700490514744,1.0046687548017257,10.076236629040837,6.6652071322581428,3.673161594784597,11.700600841664842,4.0623707703909115,2.1893016127855214,6.8841372935366953,5.3744012424939065,3.2830748648710988,7.7732756168259511,4.7362391493222411,2.9755268681618623,6.5661497297421976]
["London","Camden",34359,51571,83480,317,153,657,202,88,441,510,349,725,419,263,645,1270,928,1563,1097,802,1365,9.2261125178264791,4.4529817515061554,19.12162752117349,5.8791000902238135,2.5611921185133446,12.835065048458919,9.8892788582730606,6.767369257916271,14.058288573035233,8.1247212580713963,5.0997653720114018,12.507029144286518,15.213224724484906,11.116435074269287,18.723047436511738,13.140872065165309,9.6070915189266888,16.3512218495448]
["London","City of London",650,1838,3467,4,2,7,3,1,7,12,5,18,9,3,17,12,6,19,11,4,19,6.1538461538461542,3.0769230769230771,10.76923076923077,4.615384615384615,1.5384615384615385,10.76923076923077,6.5288356909684442,2.7203482045701848,9.7932535364526654,4.8966267682263327,1.632208922742111,9.2491838955386285,3.4612056533025672,1.7306028266512836,5.4802422843957315,3.1727718488606866,1.1537352177675224,5.4802422843957315]
["London","Croydon",45432,57225,146914,154,99,282,116,44,292,577,417,848,365,249,581,1297,976,1630,1005,750,1265,3.3896812819158302,2.1790808240887478,6.2070787110406762,2.5532664201443915,0.96848036626166578,6.4271878851910547,10.083005679335955,7.2870249017038011,14.818698121450415,6.3783311489733512,4.3512450851900395,10.152905198776759,8.8282941040336524,6.6433423635596336,11.094926283403897,6.8407367575588438,5.1050274310140624,8.6104796003103861]
["London","Ealing",38826,62801,132214,203,126,376,138,66,276,949,681,1267,688,491,959,1312,954,1671,1203,885,1502,5.2284551589141293,3.2452480296708393,9.6842322155256788,3.5543192705918716,1.6998918250656776,7.1086385411837432,15.111224343561409,10.843776372987691,20.174837980286938,10.955239566248945,7.8183468416108024,15.270457476791771,9.9233061551726749,7.2155747500264722,12.638601055863978,9.0988851407566518,6.6936935574144947,11.360370308741889]
["London","Enfield",40867,51040,121782,308,170,580,332,143,815,406,295,580,352,205,567,1075,837,1424,684,418,1108,7.5366432573959425,4.1598355641471114,14.192380160031322,8.1239141605696528,3.4991557980766879,19.942741086940565,7.9545454545454541,5.7797805642633229,11.363636363636363,6.8965517241379306,4.0164576802507836,11.108934169278998,8.8272486902826355,6.8729368872247134,11.693025241825557,5.6165935852589053,3.4323627465471089,9.0982246965889875]
["London","Greenwich",34267,50159,100401,145,53,251,70,29,156,552,336,861,308,180,474,750,480,993,733,507,968,4.231476347506347,1.5466775615023201,7.3248314705109872,2.0427816850030642,0.84629526950126943,4.5524848980068287,11.005004087003329,6.69869813991507,17.165413983532368,6.1404732949221472,3.5885882892402163,9.4499491616659022,7.4700451190725188,4.7808288762064119,9.890339737652015,7.3007240963735418,5.0497505004930225,9.6413382336829319]
["London","Hackney",30843,71765,89922,197,89,321,103,69,201,906,654,1244,479,277,712,1450,1126,1751,1407,1085,1709,6.3871867198391854,2.8855818175923225,10.407547903900399,3.3394935641798789,2.2371364653243848,6.5168757902927732,12.624538424022852,9.1130774054204693,17.334355187068905,6.6745628091688145,3.8598202466383333,9.9212708144638757,16.125086185805475,12.521963479459977,19.472431662996819,15.646893974778141,12.066012766619959,19.005360201063144]
["London","Hammersmith and Fulham",20402,43798,66717,177,74,461,116,38,387,317,192,480,160,95,264,1006,711,1260,902,638,1113,8.6756200372512495,3.6270953828056074,22.595823938829525,5.6857170865601407,1.8625624938731498,18.968728556023919,7.2377734143111558,4.3837618156080183,10.959404539020047,3.6531348463400155,2.1690488150143841,6.027672496461026,15.078615645187883,10.656953999730204,18.885741265344663,13.519792556619752,9.5627801010237263,16.682404784387789]
["London","Haringey",32213,57553,102475,136,51,272,84,40,196,494,345,703,372,193,593,1226,889,1569,950,647,1237,4.2218979914941173,1.583211746810294,8.4437959829882345,2.6076428770993076,1.2417347033806228,6.0845000465650516,8.5833926989036193,5.9944746581411916,12.214828071516688,6.4636074574739801,3.3534307507862318,10.303546296457178,11.963893632593315,8.6752866552817753,15.311051475969748,9.2705537936081974,6.3137350573310567,12.071236887045622]
["London","Harrow",28349,39890,94085,153,48,329,90,32,220,396,270,586,404,263,685,644,479,871,508,349,831,5.3970157677519488,1.6931814173339448,11.605347631309746,3.1747151575011463,1.1287876115559632,7.7604148294472468,9.9273000752068192,6.7686136876410128,14.690398596139383,10.127851591877663,6.5931311105540233,17.172223614941089,6.8448743157782852,5.0911409895307438,9.257586225221873,5.3993729074772814,3.709411702184195,8.8324387521921661]
["London","Havering",30227,32503,93552,164,70,389,116,43,416,199,127,309,119,66,226,531,357,733,511,304,867,5.4256128626724456,2.3158103682138487,12.869289046216958,3.8376286101829491,1.422569226188507,13.7625301882423,6.1225117681444789,3.9073316309263761,9.5068147555610256,3.661200504568809,2.0305817924499276,6.9532043196012676,5.6759876859928164,3.8160595177013854,7.8352146399863178,5.4622028390627673,3.2495296733367538,9.2675731144176492]
["London","Hillingdon",40787,46796,107989,244,149,460,272,85,696,607,457,835,323,171,470,1195,955,1582,749,408,1032,5.9822982813151251,3.6531247701473508,11.278103317233432,6.6687915267119422,2.0839973520974819,17.064260671292324,12.971194119155484,9.7657919480297455,17.843405419266603,6.9022993418240874,3.6541584750833405,10.043593469527311,11.065941901489966,8.8434933187639491,14.649640241135671,6.935891618590782,3.7781625906342313,9.5565289057218799]
["London","Hounslow",31314,51276,100653,204,108,388,130,75,239,592,330,852,476,281,642,740,484,1060,674,476,899,6.5146579804560263,3.4489365778884844,12.390624002043815,4.1514977326435458,2.3950948457558918,7.632368908475442,11.545362352757625,6.4357594196115144,16.615960683360637,9.2830954052578196,5.4801466573055624,12.520477416335128,7.3519914955341621,4.8085998430250463,10.531231061170557,6.6962733351216555,4.7291188538841364,8.931676154709745]
["London","Islington",32713,59329,75966,219,105,470,99,52,276,486,331,678,289,142,454,1463,1144,1768,1361,1074,1628,6.6945862501146332,3.2097331336166048,14.36737688380766,3.026319811695656,1.5895821233148901,8.4370128083636473,8.1916094995701929,5.5790591447690003,11.4278009068078,4.8711422744357735,2.3934332282694806,7.6522442650305917,19.258615696495802,15.059368664929048,23.273569754890346,17.915909749098279,14.137903799068004,21.430640023168259]
["London","Kensington and Chelsea",15598,30183,64443,71,23,215,20,8,142,327,210,582,138,66,252,852,660,1357,636,427,797,4.5518656237979229,1.4745480189767919,13.783818438261315,1.2822156686754713,0.51288626747018851,9.1037312475958458,10.833913129907565,6.9575588907663253,19.282377497266673,4.5721101282178713,2.1866613656694165,8.349070668919591,13.220985987616963,10.241608863646944,21.057368527225609,9.8691867231506905,6.6260105829958258,12.367518582313052]
["London","Kingston upon Thames",22921,27620,65513,80,29,295,43,16,161,184,103,346,156,97,286,289,170,483,251,155,408,3.4902491165306926,1.265215304742376,12.870293617206928,1.8760089001352471,0.69804982330613852,7.0241263470180186,6.6618392469225203,3.7291817523533672,12.527154236060825,5.6480811006517015,3.5119478638667632,10.354815351194786,4.4113382076839711,2.5949048280493949,7.3725825408697512,3.8313006578846944,2.3659426373391539,6.2277715873185473]
["London","Lambeth",36460,89522,113876,176,77,364,68,45,168,581,402,799,437,286,640,1630,1223,2069,1313,985,1630,4.8272078990674716,2.1119034558420187,9.9835436094349976,1.8650575973669774,1.2342292923752056,4.6077893582007681,6.4900247983735841,4.4905162976698465,8.9251804025826047,4.8814816469694602,3.1947454257054133,7.1490806729072185,14.313815026871334,10.73975201095929,18.168885454353859,11.530085356001264,8.6497593874038436,14.313815026871334]
["London","Lewisham",35161,58697,113170,178,72,343,114,61,239,425,275,619,313,145,516,1337,961,1720,1059,734,1385,5.0624271209578797,2.0477233298256592,9.7551264184750153,3.2422286055572935,1.7348767099911835,6.7973038309490628,7.2405744756972243,4.6850776019217335,10.545683765780193,5.3324701432781918,2.4703136446496412,8.7909092457876898,11.814085004859946,8.4916497304939469,15.198374127418928,9.3576036051957239,6.4858177962357519,12.238225678183264]
["London","Merton",20310,39059,80134,78,19,162,38,7,130,200,65,359,141,53,332,357,168,668,313,117,501,3.8404726735598227,0.93549975381585426,7.9763663220088628,1.8709995076317085,0.34465780403741997,6.4007877892663716,5.1204587931078622,1.6641491077600552,9.1912235336286123,3.6099234491410432,1.3569215801735837,8.4999615965590518,4.4550378116654601,2.0964883819602167,8.3360371377941949,3.9059575211520703,1.4600544088651508,6.2520278533456457]
["London","Newham",47979,76673,106704,377,163,583,162,109,257,809,536,1074,854,630,1146,1214,833,1773,861,631,1109,7.8576043685779196,3.3973196606848828,12.151149461222618,3.3764772087788408,2.2718272577586025,5.3565101398528521,10.551302283724388,6.9907268529991002,14.007538507688496,11.138210321756029,8.2167125324429726,14.946591368539121,11.377267956215325,7.8066426750637277,16.616059379217273,8.0690508322087275,5.9135552556605191,10.393237366921577]
["London","Redbridge",36338,50419,107776,168,43,350,90,32,200,370,212,594,346,194,537,595,356,900,459,273,670,4.6232593978755023,1.1833342506467059,9.6317904122406297,2.4767461060047333,0.88062083769057187,5.5038802355660739,7.3385033419940893,4.2047640770344517,11.781272932822944,6.8624923144052836,3.847755806342847,10.65074674229953,5.5207096199524939,3.303147268408551,8.350653206650831,4.2588331353919244,2.5330314726840855,6.2165973871733966]
["London","Richmond upon Thames",17477,26848,83068,91,23,516,52,11,137,219,80,401,177,89,387,512,221,789,399,252,665,5.2068432797390853,1.3160153344395491,29.524517937861187,2.9753390169937632,0.62939863821021913,7.8388739486181835,8.1570321811680575,2.9797377830750893,14.935935637663885,6.592669845053635,3.3149582836710367,14.414481525625744,6.1636249819425046,2.6604709394712764,9.4982424038137427,4.8032936870997256,3.0336591707998268,8.005489478499543]
["London","Southwark",41327,72493,111415,164,68,323,144,69,418,478,219,736,341,150,573,1615,1155,2157,1306,960,1645,3.9683499891112346,1.6454134101192925,7.8157136980666388,3.4844048684879136,1.6696106661504586,10.114453021027416,6.5937400852496104,3.0209813361290054,10.152704399045424,4.7039024457533829,2.069165298718497,7.9042114411046587,14.495355203518377,10.3666472198537,19.360050262531974,11.721940492752323,8.6164340528654133,14.764618767670422]
["London","Sutton",21657,28189,80362,133,48,406,69,16,188,267,146,435,215,93,389,436,264,670,452,261,697,6.1412014591125272,2.2163734589278294,18.746825506764555,3.1860368472087548,0.73879115297594311,8.6807960474673322,9.4717797722515868,5.1793252687218416,15.431551314342475,7.6270885806520274,3.299159246514598,13.799709106389017,5.4254498394763697,3.2851347651875265,8.3372738358925869,5.6245489161544011,3.2478036883103956,8.6732535277867644]
["London","Tower Hamlets",41993,83703,86796,410,201,809,120,55,254,852,583,1086,697,438,932,1536,1197,1863,1492,1152,1856,9.7635320172409692,4.7865120377205725,19.265115614507181,2.8576191269973568,1.3097420998737885,6.0486271521444053,10.178846636321278,6.9651028039616261,12.974445360381349,8.3270611567088402,5.2327873552919248,11.134606883863183,17.696668049218857,13.790958108668603,21.464122770634592,17.189732245725608,13.272501036914143,21.383473892806119]
["London","Waltham Forest",32585,51970,100580,170,102,292,180,111,351,487,319,682,448,317,631,821,550,1114,702,544,965,5.2171244437624678,3.1302746662574803,8.9611784563449444,5.5240141169249659,3.4064753721037286,10.771827528003683,9.3707908408697325,6.1381566288243219,13.122955551279585,8.6203578987877627,6.0996728882047337,12.141620165480084,8.1626565917677478,5.4682839530721816,11.075760588586199,6.9795187910121292,5.408629946311394,9.5943527540266462]
["London","Wandsworth",30592,88895,111305,142,61,221,90,27,219,468,227,678,237,134,415,887,573,1375,813,504,1121,4.64173640167364,1.9939853556485356,7.2241108786610875,2.9419456066945608,0.88258368200836823,7.1587343096234308,5.2646380561336406,2.5535744417571293,7.6269756454243769,2.6660667079138309,1.5073963664998031,4.6684290455031219,7.9690939310902476,5.1480167108395847,12.353443241543507,7.30425407663627,4.5280984681730381,10.071425362742016]
["London","Westminster",25626,54515,90526,172,62,625,55,18,138,487,335,684,333,238,485,1590,1231,1977,1115,882,1352,6.7119331928510109,2.4194177788183877,24.38929212518536,2.1462577070163116,0.70241161320533829,5.3851557012409268,8.933321104283225,6.1450976795377423,12.547005411354673,6.1084105292121436,4.3657708887462165,8.8966339539576271,17.564014758191018,13.598303249895057,21.839029671033735,12.316903431058481,9.7430572432229408,14.934935819543556]
["North East","County Durham",11925,12811,41653,239,162,386,179,64,397,942,711,1259,826,568,1105,1130,811,1461,996,698,1322,20.041928721174003,13.584905660377359,32.368972746331238,15.010482180293501,5.366876310272537,33.291404612159326,73.530559675279051,55.49918039185075,98.274919990633052,64.475841074076968,44.336897978299902,86.254000468347513,27.128898278635393,19.470386286702038,35.075504765563103,23.911843084531725,16.757496458838499,31.738410198545122]
["North East","Darlington",68825,60220,204431,49,30,141,31,21,74,252,179,329,200,154,279,505,383,620,425,355,562,0.71195059934616778,0.43588812204867416,2.0486741736287688,0.45041772611696329,0.30512168543407192,1.0751907010533963,4.1846562603786115,2.9724344071736963,5.4633012288276319,3.3211557622052474,2.5572899368980404,4.6330122882763201,2.4702711428305881,1.8734927677309214,3.0328081357524055,2.0789410607980199,1.7365272390195226,2.7490938262787932]
["North East","Gateshead",23624,27796,78193,103,65,480,152,83,335,797,615,999,677,517,874,862,648,1072,786,591,993,4.3599729089061974,2.7514392143582795,20.31832035218422,6.4341347781916696,3.5133762275651881,14.180494412461902,28.673190387106057,22.125485681393005,35.940423082457905,24.356022449273276,18.5997985321629,31.443373147215425,11.024004706303634,8.2871868325809217,13.709667105751155,10.052050695075007,7.5582213241594518,12.699346488816134]
["North East","Hartlepool",11550,11446,35933,47,30,129,26,20,55,333,263,444,243,209,321,664,562,854,649,571,798,4.0692640692640696,2.5974025974025974,11.168831168831169,2.2510822510822512,1.7316017316017316,4.7619047619047619,29.093132972217369,22.977459374453957,38.790843962956494,21.23012406080727,18.259654027607898,28.044731784029356,18.478835610719951,15.640219297025018,23.766454234269336,18.061392035176578,15.890685442351042,22.207998218907409]
["North East","Middlesbrough",21314,18877,50281,128,93,200,105,75,182,782,626,932,647,538,761,1264,1085,1469,1184,1041,1313,6.0054424322041848,4.3633292671483535,9.3835038003190387,4.9263394951674959,3.5188139251196398,8.5389884582903264,41.426074058377921,33.162049054404832,49.372251946813584,34.274513958785825,28.500291359855908,40.313609153996929,25.13872039140033,21.578727551162466,29.215807163739782,23.547662138780055,20.703645512221318,26.113243571130248]
["North East","Newcastle upon Tyne",60840,44518,95803,255,83,487,162,50,359,729,488,1059,638,445,882,1067,818,1319,983,712,1274,4.1913214990138066,1.3642340565417488,8.0046022353714665,2.6627218934911241,0.82182774490466803,5.9007232084155161,16.375398715126465,10.961858124803451,23.788130643784537,14.331281728738936,9.9959566916752767,19.812210791140661,11.137438284813628,8.538354748807448,13.767836080289761,10.260639019654917,7.4319175808690749,13.298122188240452]
["North East","North Tyneside",21459,25791,83146,72,41,169,44,30,97,407,284,588,375,249,652,629,476,882,515,401,921,3.3552355654969941,1.9106202525746774,7.8754834801248892,2.0504217344703854,1.3980148189570809,4.5202479146278947,15.780698693342639,11.011593191423366,22.798650692101894,14.539955798534372,9.6545306502268229,25.280136481718429,7.5650061337887573,5.7248695066509514,10.607846438794409,6.1939239410194116,4.8228417482500658,11.07690087316287]
["North East","Northumberland",33291,32511,130094,168,106,320,106,71,215,441,349,639,387,314,520,647,533,933,599,505,782,5.0464089393529781,3.1840437355441411,9.6122075035294827,3.1840437355441411,2.1327085398456038,6.4582019164338709,13.564639660422626,10.734828211989788,19.654886038571561,11.903663375472917,9.6582695087816433,15.994586447663867,4.97332697895368,4.0970375267114552,7.1717373591403142,4.6043629990622161,3.8818085384414345,6.0110381723984192]
["North East","Redcar and Cleveland",15935,15388,52387,185,89,440,110,60,247,440,276,720,415,309,594,572,395,947,428,330,587,11.609664261060558,5.5851898336994035,27.612174458738625,6.9030436146846563,3.7652965171007216,15.500470662064638,28.593709383935533,17.936054068105015,46.789706264621785,26.969066805302834,20.08058227190018,38.601507668312969,10.918739381907725,7.5400385591845307,18.077003836829746,8.1699658312176684,6.2992727203313796,11.205069960104606]
["North East","South Tyneside",17957,18377,59510,153,60,418,48,18,103,232,125,321,224,159,291,330,191,448,316,252,415,8.5203541794286348,3.3413153644818179,23.277830372556664,2.6730522915854542,1.0023946093445453,5.7359247090271204,12.624476247483267,6.8019807367905534,17.467486532078141,12.189149480328672,8.6521194971975834,15.835011155248408,5.5452865064695009,3.2095446143505293,7.5281465299949586,5.3100319274071586,4.2345824231221645,6.9736178793480086]
["North East","Stockton-On-Tees",24338,25446,75666,183,106,367,92,57,187,917,738,1176,802,667,1012,798,618,1011,763,620,931,7.5191059248911172,4.3553291149642535,15.079299860300765,3.7800969677048237,2.3420165995562496,7.6834579669652392,36.037098168670909,29.002593727894364,46.215515208677196,31.517723807278159,26.212371296077968,39.770494380256231,10.546348425977321,8.1674728411704063,13.36135120133217,10.083789284487088,8.1939047921127059,12.304073163640208]
["North East","Sunderland",36664,34839,109538,145,49,286,97,28,229,570,450,679,511,311,722,638,470,878,673,435,939,3.9548330787693651,1.3364608335151646,7.8005673139864715,2.6456469561422651,0.7636919048658084,6.2459087933667901,16.360974769654696,12.916559028674762,19.489652401044808,14.667470363672896,8.9267774620396683,20.723901374895949,5.8244627435227958,4.2907484160747869,8.015483211305666,6.1439865617411309,3.9712245978564518,8.5723675802004777]
["North West","Blackburn with Darwen",19113,20476,54589,83,34,168,51,22,123,354,262,480,284,200,384,926,765,1069,875,727,1027,4.3425940459373198,1.7788939465285407,8.7898289122586721,2.668340919792811,1.1510490242243498,6.4354104536179566,17.288532916585272,12.795467864817347,23.44207853096308,13.869896464153156,9.7675327212346161,18.753662824770462,16.963124438989539,14.013812306508637,19.582699811317298,16.028870285222297,13.317701368407555,18.813314037626629]
["North West","Blackpool",16859,16640,54821,76,46,148,43,27,95,398,299,501,348,262,435,1288,1096,1472,1168,1017,1314,4.5079779346343196,2.7285129604365621,8.7786938727089385,2.5505664630167861,1.601518476777982,5.6349724182929002,23.91826923076923,17.96875,30.108173076923077,20.91346153846154,15.745192307692308,26.141826923076923,23.494646212217944,19.992338702322101,26.851024242534795,21.305704018533042,18.551285091479542,23.968917020849673]
["North West","Bolton",35574,36773,106536,243,129,538,115,40,256,713,532,1024,652,488,923,1792,1446,2296,1779,1460,2256,6.8308315061561817,3.6262438859841457,15.123404733794343,3.2326980378928432,1.1244167088322932,7.1962669365266771,19.389225790661627,14.467136214070106,27.846517825578548,17.730400021755091,13.270606151252277,25.099937454110353,16.82060524142074,13.572876774048209,21.551400465570325,16.698580761432755,13.704287752496809,21.175940527145755]
["North West","Bury",21772,23627,73637,107,18,272,51,10,125,366,256,565,180,137,249,695,505,1021,504,415,613,4.9145691714128237,0.82674995406944696,12.49311041704942,2.3424582031967667,0.45930553003858166,5.7413191254822706,15.49075210564185,10.835061582088288,23.913319507343292,7.6184026749058278,5.798450924789436,10.538790366953062,9.4381900403329855,6.8579654249901543,13.865312275079104,6.8443852954357185,5.6357537650909189,8.3246194168692362]
["North West","Cheshire \n(Cheshire West, Cheshire East and Cheshire UA)",79403,75646,286960,291,67,533,178,59,736,909,644,1193,747,390,1163,2084,1490,2742,1960,1294,2592,3.6648489351787714,0.8437968338727756,6.712592723196857,2.2417289019306574,0.74304497311184714,9.2691711900054159,12.016497898104328,8.5133384448615921,15.770827274409751,9.8749438172540511,5.1555931576025174,15.374243185363403,7.2623362141064955,5.1923613047114578,9.555338723166992,6.8302202397546701,4.5093392807359907,9.0326177864510733]
["North West","Cumbria",54207,52072,202208,146,92,273,114,71,233,702,555,919,642,496,843,1896,1644,2312,1931,1675,2412,2.6933790838821556,1.697197778884646,5.0362499308207429,2.1030494216614088,1.3097939380522812,4.29833785304481,13.481333538177907,10.658319250268859,17.648640344138883,12.329082808419113,9.5252726993393768,16.189122753111079,9.3764836208260807,8.1302421269188159,11.433771166323785,9.5495727172020892,8.2835496122804244,11.92831144168381]
["North West","Halton",15105,16101,50503,36,15,228,13,8,39,180,117,265,132,89,249,483,328,611,502,360,842,2.3833167825223436,0.99304865938430986,15.09433962264151,0.86064217146640187,0.52962595167163196,2.5819265143992056,11.179429849077698,7.2666294019005031,16.458605055586609,8.1982485559903111,5.5276069809328616,15.464877957890815,9.5637882898045667,6.4946636833455438,12.098291190622339,9.9400035641447051,7.1282894085499873,16.672276894441914]
["North West","Knowsley",19350,18689,57480,67,20,144,42,16,192,144,89,275,101,62,194,879,671,1071,806,605,937,3.4625322997416021,1.0335917312661498,7.441860465116279,2.1705426356589146,0.82687338501291985,9.9224806201550386,7.7050671518005247,4.7621595590989356,14.714537963507945,5.4042484884156456,3.3174594681363367,10.38043769062015,15.292275574112734,11.673625608907447,18.632567849686847,14.022268615170494,10.525400139178846,16.301322199025748]
["North West","Lancashire",153660,138771,456901,585,173,1129,353,78,980,1616,1209,2003,1331,918,1917,4510,3397,5801,4206,3064,5200,3.8071065989847717,1.1258622933749838,7.3473903423142,2.297279708447221,0.50761421319796951,6.3777170376155148,11.645084347594238,8.7121949110404913,14.433851453113403,9.5913411303514415,6.6152149944873209,13.814125429664699,9.8708472951470885,7.4348710114444927,12.696404691607153,9.2054952823478171,6.7060479184768695,11.381021271566489]
["North West","Liverpool",82382,77643,168926,331,124,693,189,86,450,828,629,1085,610,362,908,4098,3480,4707,3795,3178,4367,4.0178679808696076,1.5051831710810615,8.4120317545094796,2.2941904785025855,1.0439173605884782,5.4623582821490135,10.664193810130984,8.10118104658501,13.97421531883106,7.8564712852414251,4.6623649266514686,11.694550699998713,24.259143056723062,20.600736417129394,27.864271929720704,22.465458247990245,18.812971360240578,25.851556302759789]
["North West","Manchester",102245,107760,162721,332,81,813,206,54,512,808,601,1051,569,425,739,3174,2467,3902,2979,2388,3536,3.2471025478018487,0.79221477822876429,7.9514890703701893,2.0147684483348818,0.52814318548584283,5.0075798327546579,7.4981440237564962,5.5772086117297697,9.7531551596139572,5.2802524127691166,3.9439495174461765,6.8578322197475874,19.505779831736529,15.160919610867682,23.979695306690594,18.307409615230977,14.675426035975688,21.730446592634017]
["North West","Oldham",28996,30935,84487,160,43,337,59,13,159,514,384,700,276,187,450,988,794,1250,980,807,1425,5.5180024831011174,1.4829631673334254,11.622292730031729,2.0347634156435372,0.4483377017519658,5.4835149675817352,16.615484079521579,12.413124292872151,22.628091158881524,8.921933085501859,6.0449329238726364,14.546630030709553,11.694106785659333,9.397895534224201,14.795175589143891,11.599417661888811,9.5517653603512969,16.866500171624036]
["North West","Rochdale",27260,28594,81302,116,56,311,47,29,153,609,402,978,276,205,402,1105,816,1512,1089,922,1315,4.2553191489361701,2.0542920029347029,11.408657373440938,1.7241379310344827,1.0638297872340425,5.6126192223037421,21.298174442190671,14.058893474155417,34.202979646079598,9.6523746240470025,7.1693362243827377,14.058893474155417,13.591301566997123,10.036653464859413,18.597328479004208,13.394504440235172,11.340434429657327,16.174263855747707]
["North West","Salford",33066,42003,86666,91,17,250,54,9,150,335,211,504,243,164,344,973,689,1267,910,684,1142,2.7520716143470634,0.51412326861428659,7.5606363031512736,1.6330974414806749,0.27218290691344582,4.5363817818907641,7.9756207889912627,5.0234507059019595,11.999142918362974,5.785301049925005,3.9044830131181105,8.1898911982477447,11.227009438534143,7.9500611543165718,14.61934322571712,10.500080769852076,7.8923684028338679,13.177024438649529]
["North West","Sefton",30980,29840,107842,83,54,162,62,37,156,316,238,459,238,166,388,1287,1123,1531,1315,1140,1789,2.6791478373143964,1.7430600387346675,5.2291801162040024,2.0012911555842479,1.1943189154293092,5.0355067785668171,10.589812332439678,7.975871313672922,15.382037533512065,7.975871313672922,5.5630026809651474,13.002680965147453,11.934125850781699,10.41338254112498,14.196695165149015,12.193764952430408,10.571020567125981,16.589084030340683]
["North West","St. Helens",20777,21669,69863,131,56,448,57,34,116,264,177,357,206,159,286,991,715,1187,875,757,1082,6.3050488520960677,2.695288058911296,21.562304471290368,2.7434182028204264,1.6364248929104297,5.5830966934591135,12.183303336563755,8.1683511006506997,16.475148830125985,9.506668512621717,7.3376713277031707,13.198578614610735,14.184904742138185,10.234315732218771,16.990395488312842,12.524512259708287,10.835492320684768,15.487454017147847]
["North West","Stockport",31090,33861,114980,108,40,397,53,23,292,397,260,646,277,181,404,1013,780,1373,913,689,1138,3.4737857832100354,1.2865873271148278,12.769379221614667,1.7047282084271469,0.73978771309102609,9.3920874879382445,11.724402705177047,7.678450134372877,19.077995333864919,8.1805026431587962,5.345382593544195,11.931130208794778,8.8102278657157775,6.783788484953905,11.941207166463732,7.9405113932857887,5.9923464950426162,9.8973734562532609]
["North West","Tameside",26334,28856,87108,153,59,531,49,20,227,335,234,500,318,238,434,908,643,1313,831,668,942,5.8099794941900207,2.2404496088706614,20.164046479835953,1.8607123870281765,0.75947444368496997,8.6200349358244104,11.609370668145273,8.109232048794011,17.327418907679512,11.02023842528417,8.2478514000554473,15.040199611865816,10.423841667814667,7.381641181062589,15.073242411718786,9.5398815263810448,7.6686412269825963,10.814161730265877]
["North West","Trafford",25082,28915,94239,97,24,162,60,11,153,194,108,267,148,49,277,567,335,845,524,313,768,3.8673152061239136,0.95686149429870027,6.4588150865162266,2.3921537357467506,0.43856151822023764,6.0999920261542142,6.7093204219263356,3.7350855957115683,9.2339616116202663,5.1184506311602975,1.6946221684246932,9.5798028704824478,6.0166173240378189,3.554791540657265,8.9665637368817581,5.5603306486698711,3.3213425439573849,8.1494922484321783]
["North West","Warrington",23742,26142,83609,41,26,154,39,19,179,225,161,305,130,85,186,681,552,833,633,490,742,1.7268974812568445,1.0951057198214136,6.4863954174037568,1.6426585797321203,0.80026956448487907,7.5393816864628089,8.6068395685104431,6.1586718690230278,11.667049192869712,4.9728406395838114,3.2514727258817229,7.1149873766352991,8.1450561542417681,6.6021600545395831,9.9630422562164362,7.5709552799339788,5.860613091892021,8.8746426820079183]
["North West","Wigan",37339,40791,128386,175,52,329,100,29,241,540,353,819,490,317,717,1440,1094,1769,1277,983,1585,4.6867886124427542,1.392645759125847,8.8111625913923781,2.6781649213958594,0.77666782720479932,6.4543774605640216,13.238214311980585,8.6538697261650857,20.077958373170553,12.012453727537938,7.7713221053663801,17.577406780907552,11.216176218590812,8.5211783216238537,13.778760924088296,9.9465673827364363,7.6565980714408113,12.345582851712804]
["North West","Wirral",36038,36557,126474,128,60,411,107,47,324,288,223,391,297,212,439,2421,2097,2881,2258,1891,2587,3.5518064265497529,1.6649092624451967,11.404628447749598,2.9690881846939341,1.3041789222487374,8.9905100172040626,7.8781081598599449,6.1000629154471104,10.695626008698744,8.1242990398555683,5.7991629510080145,12.008644035342069,19.14227430143745,16.58048294511125,22.779385486345021,17.853471859828897,14.951689675348293,20.454797033382356]
["South East","Bracknell Forest",13519,16548,48962,15,5,68,28,3,68,146,60,250,86,44,145,211,98,340,122,75,212,1.1095495228937051,0.36984984096456841,5.0299578371181299,2.0711591094015831,0.22190990457874102,5.0299578371181299,8.8228184674885188,3.6258158085569252,15.107565868987189,5.1970026589315932,2.6589315929417454,8.76238820401257,4.3094644826600224,2.001552224173849,6.9441607777460073,2.4917282790735671,1.5318001715616192,4.3298884849475101]
["South East","Brighton and Hove",48400,45905,106377,160,87,356,148,78,415,587,458,744,556,355,999,1381,1158,1646,1394,1107,2414,3.3057851239669422,1.7975206611570247,7.3553719008264462,3.0578512396694215,1.6115702479338843,8.5743801652892557,12.787278074283847,9.9771266746541762,16.207384816468796,12.111970373597646,7.7333623788258361,21.762335257597211,12.982129595683277,10.885811782622183,15.473269597751393,13.104336463709261,10.406384838827941,22.692875339594085]
["South East","Buckinghamshire",58180,58400,212107,213,42,455,132,27,338,590,306,874,479,226,743,844,417,1452,783,389,1210,3.6610519078721211,0.72189755929872812,7.8205568924028874,2.2688209006531452,0.46407700240632521,5.8095565486421448,10.102739726027398,5.2397260273972606,14.965753424657533,8.2020547945205475,3.8698630136986303,12.722602739726028,3.979123744148001,1.9659888641110383,6.8456015124441905,3.6915330469998633,1.8339800195184506,5.7046679270368257]
["South East","East Sussex",57798,52963,209753,270,74,459,106,51,273,511,283,951,467,282,742,1515,1003,1969,1408,967,1832,4.6714419184054812,1.2803211183777985,7.941451261289318,1.8339734938925223,0.88238347347659085,4.7233468286099862,9.6482450012272718,5.3433529067462189,17.955931499348601,8.8174763514151397,5.3244718010686709,14.00978041274097,7.2227810806043298,4.7818148012185757,9.3872316486534153,6.7126572683108225,4.6101843596992653,8.7340824684271503]
["South East","Hampshire",150115,149558,540089,336,230,521,308,67,776,980,836,1168,1021,503,1603,1899,1671,2201,1499,963,2221,2.2382839822802518,1.532158678346601,3.4706724844286048,2.0517603170902308,0.44632448456183593,5.1693701495520097,6.5526417844582037,5.589804624292916,7.809679188007328,6.8267829203385979,3.3632436914106902,10.718249776006633,3.5160871634119562,3.0939345181997782,4.0752542636491391,2.7754684876011178,1.783039462014594,4.1122851974396815]
["South East","Isle of Wight",14814,13205,54189,40,7,97,24,4,63,129,68,198,120,60,229,375,225,552,337,200,454,2.700148508167949,0.47252598892939113,6.5478601323072771,1.6200891049007695,0.27001485081679494,4.2527339003645199,9.7690268837561529,5.1495645588792121,14.994320333207119,9.0874668686103757,4.5437334343051878,17.341915940931464,6.9202236616287438,4.1521341969772463,10.186569229917511,6.2189743305836975,3.6907859528686635,8.378084113011866]
["South East","Kent",187791,174639,582917,870,303,1474,685,306,1365,1539,706,2866,1406,585,2385,2789,1627,3864,2310,1202,3706,4.632809879067687,1.6134958544339186,7.8491514502824948,3.6476721461624892,1.6294710609134624,7.2687189481924053,8.8124645697696398,4.042625072291985,16.41099639828446,8.0508935575673242,3.3497672341229623,13.656743339116693,4.7845576642986911,2.7911349300157657,6.6287310200251497,3.962828327188948,2.0620431382169331,6.3576804244858192]
["South East","Medway",37895,37677,104723,530,128,1189,107,36,266,225,50,420,392,223,607,504,111,899,709,490,994,13.986013986013987,3.3777543211505474,31.376170998812508,2.8235915028367859,0.94999340282359146,7.0193956986409818,5.9718130424396847,1.3270695649865967,11.147384345887412,10.404225389494917,5.9187302598402205,16.110624518937282,4.8126963513268333,1.0599390773755526,8.584551626672269,6.770241494227629,4.6790103415677553,9.4917066928945886]
["South East","Milton Keynes",27958,39527,103746,112,51,249,70,19,195,314,163,517,332,163,550,580,286,871,444,240,709,4.0060090135202806,1.8241648186565562,8.9062164675584814,2.5037556334501754,0.67959081479361905,6.9747478360397741,7.943937055683457,4.1237635034280364,13.079667063020214,8.3993219824423804,4.1237635034280364,13.914539428744909,5.5905769861006691,2.7567327896979159,8.3955044049891079,4.2796830721184431,2.3133422011451046,6.8339984192161625]
["South East","Oxfordshire",91033,91590,256434,507,211,1174,259,63,675,1109,585,1643,987,551,1681,1317,811,1960,1565,1101,2466,5.5694088956751946,2.3178407830127536,12.896422176573331,2.8451220985796359,0.69205672668153306,7.4148935001592831,12.108308767332678,6.3871601703242709,17.938639589474832,10.77628562070095,6.0159406048695274,18.353532044983076,5.1358244226584615,3.1626071425785973,7.6432922311393963,6.1029348682312019,4.2935024216757531,9.6165095112192613]
["South East","Portsmouth",37945,32550,72441,114,68,222,70,39,199,551,411,782,447,298,612,762,590,1006,798,557,999,3.0043483989985504,1.7920674660693108,5.8505731980498092,1.8447753327184082,1.027803399657399,5.2444327315851895,16.927803379416282,12.626728110599078,24.02457757296467,13.732718894009217,9.1551459293394775,18.801843317972349,10.518905039963556,8.1445590204442233,13.88716334672354,11.015861183583882,7.6890158887922588,13.790532985464033]
["South East","Reading",24303,29165,57125,114,71,261,100,42,210,457,342,679,382,294,572,761,599,1107,675,545,956,4.690778916183187,2.9214500267456693,10.739414887050982,4.114718347529112,1.7281817059622269,8.640908529811135,15.66946682667581,11.726384364820847,23.281330361734955,13.097891308074747,10.080576032916166,19.612549288530772,13.321663019693654,10.485776805251641,19.378555798687088,11.816192560175054,9.5404814004376366,16.735229759299781]
["South East","Slough",16682,26014,53762,52,15,124,39,17,97,390,205,602,272,188,390,445,259,696,447,305,568,3.1171322383407265,0.89917276105982491,7.4331614914278861,2.3378491787555449,1.0190624625344682,5.8146505215202016,14.991927423694934,7.8803721073268242,23.141385407857307,10.455908357038517,7.2268778350119165,14.991927423694934,8.2772218295450326,4.8175291097801418,12.945946951378296,8.3144228265317519,5.6731520404746849,10.565083144228264]
["South East","Southampton",49147,41277,80971,170,46,345,96,30,226,614,373,943,356,217,517,699,450,932,821,598,1084,3.459010722933241,0.93596760738193585,7.0197570553645185,1.9533237023623009,0.61041365698821903,4.5984495493112503,14.875112047871696,9.0365094362477887,22.84565254257819,8.6246577997431988,5.2571650071468374,12.525135063110207,8.632720356670907,5.5575452939941457,11.510293808894543,10.139432636375986,7.3853601906855539,13.387509108199232]
["South East","Surrey",131117,131861,471901,268,178,427,291,51,727,1007,816,1254,814,359,1392,1691,1437,2027,1304,793,1931,2.043975990908883,1.3575661432156014,3.2566333885003469,2.2193918408749438,0.38896558035952622,5.5446662141446188,7.636829691872502,6.1883346857675887,9.5100143332751905,6.173167198792668,2.7225639119982405,10.556570934544711,3.5833787171461813,3.0451302285860806,4.295392465792613,2.7632914530802011,1.6804372103470855,4.0919599661793473]
["South East","West Berkshire",16751,17109,65480,12,9,23,9,6,13,220,159,329,197,138,289,292,214,418,282,214,386,0.7163751417825801,0.53728135633693508,1.3730523550832787,0.53728135633693508,0.35818757089129005,0.77607307026446182,12.858729323747735,9.2933543748904093,19.229645215968205,11.514407621719563,8.0659302121690342,16.891694429832253,4.4593769089798414,3.2681734880879656,6.3836285888821012,4.3066585216860114,3.2681734880879656,5.8949297495418449]
["South East","West Sussex",86125,90896,327036,363,102,673,239,50,626,721,328,1455,495,243,899,1562,863,2260,1496,815,2247,4.2148040638606679,1.1843251088534108,7.8142235123367199,2.7750362844702465,0.58055152394775034,7.2685050798258342,7.9321422284809016,3.6085196268262631,16.007305051927478,5.4457841929237807,2.6733849674353105,9.8904242210878373,4.776232586014995,2.638853214936582,6.9105541897528102,4.5744199415354885,2.4920803825878495,6.8708032143250284]
["South East","Windsor and Maidenhead",15060,18211,59973,29,14,108,18,10,37,166,99,250,136,82,245,336,239,472,294,214,477,1.9256308100929616,0.92961487383798136,7.1713147410358564,1.1952191235059761,0.66401062416998669,2.4568393094289509,9.1153698314205691,5.4362747789797377,13.727966613585195,7.4680138377903464,4.5027730492559446,13.453407281313492,5.6025211345105301,3.9851266403214778,7.8702082603838397,4.9022059926967136,3.5682723892418253,7.9535791105997697]
["South East","Wokingham",16514,17640,66965,21,8,119,12,4,49,134,66,292,86,39,196,185,104,373,179,88,310,1.2716482984134674,0.48443744701465424,7.2060070243429815,0.72665617052198139,0.24221872350732712,2.9671793629647571,7.5963718820861681,3.7414965986394559,16.553287981859409,4.8752834467120181,2.2108843537414966,11.111111111111111,2.7626371985365488,1.5530501007989248,5.5700739192115281,2.6730381542596877,1.3141193160606286,4.629283954304487]
["South West","Bath and North East Somerset",32113,20832,66144,33,18,132,23,13,52,436,285,755,442,283,810,538,350,909,519,294,921,1.0276212125930309,0.56052066141438051,4.1104848503721234,0.71622084514059725,0.40482047768816365,1.6192819107526546,20.929339477726575,13.680875576036867,36.242319508448539,21.217357910906298,13.584869431643625,38.882488479262676,8.133768746976294,5.2914852443154334,13.742743105950654,7.8465166908563138,4.4448476052249637,13.924165457184325]
["South West","Bournemouth",28704,29889,69571,239,107,680,83,37,185,480,343,660,405,337,539,1135,841,1514,1022,898,1268,8.3263656633221856,3.7277034559643254,23.690078037904126,2.8915830546265329,1.2890189520624302,6.445094760312152,16.059419853457793,11.475793770283381,22.081702298504467,13.550135501355014,11.275051022115159,18.033390210445315,16.314268876399648,12.08837015423093,21.761941038651162,14.690028891348407,12.907677049345272,18.225984964999785]
["South West","Bristol, City of",72746,82418,150097,531,330,934,213,92,466,1396,1097,1643,1196,869,1559,2782,2307,3239,2707,2222,3204,7.2993704121188792,4.5363318945371569,12.8391939075688,2.9279960410194374,1.2646743463558134,6.4058504934979243,16.938047513892595,13.31019922832391,19.934965662840643,14.511393142274747,10.54381324467956,18.915770826761143,18.53468090634723,15.370060694084492,21.579378668461061,18.035004030726796,14.803760235048003,21.346196126504861]
["South West","Cornwall (UA) and \nIsles of Scilly (UA)",61742,54715,215322,213,124,436,176,106,354,592,452,817,614,452,846,1306,1064,1654,1303,1064,1619,3.4498396553399631,2.0083573580382885,7.0616436137475302,2.8505717339898284,1.7168216125166014,5.7335363285931784,10.819702092661975,8.2609887599378595,14.931919948825733,11.221785616375765,8.2609887599378595,15.461939139175728,6.0653347080186881,4.9414365461959298,7.6815188415489359,6.0514020861779105,4.9414365461959298,7.518971586739859]
["South West","Devon",89425,77627,295659,96,65,180,209,41,511,538,427,703,629,344,1033,1513,1320,1785,1275,892,1719,1.0735253005311713,0.72686608890131399,2.0128599384959465,2.337154039698071,0.4584847637685211,5.7142857142857144,6.9305782781764078,5.5006634289615723,9.0561273783606211,8.1028508122173992,4.4314478209901198,13.307225578729051,5.1173818486837881,4.4646028025529407,6.0373606079977273,4.3124004342840907,3.0169891665736541,5.81413046787008]
["South West","Dorset",42387,36482,162088,121,62,329,108,25,294,520,376,796,384,211,681,1006,796,1476,897,653,1320,2.8546488310095075,1.4627126241536319,7.7618137636539508,2.5479510227192299,0.58980347748130324,6.9360888951801263,14.253604517296202,10.306452497121869,21.81897922263034,10.525738720464886,5.7836741406721126,18.666739762074446,6.2065051083362128,4.9109125906914759,9.1061645525887176,5.5340308967968017,4.0286757810572036,8.1437243966240569]
["South West","Gloucestershire",71058,69891,244787,352,109,578,186,82,453,907,528,1589,645,420,928,1570,1043,2043,1587,1073,2072,4.9536997945340424,1.533958175011962,8.1342002307973775,2.6175800050662841,1.1539868839539531,6.3750738833065945,12.977350445694009,7.5546207666223122,22.735402269247828,9.2286560501352106,6.0093574279950213,13.277818317093761,6.413739291710753,4.2608471855123025,8.3460314477484498,6.4831874241687668,4.3834027133793869,8.4645017913532996]
["South West","North Somerset",20748,21569,82676,122,21,281,64,16,547,322,218,494,226,125,437,823,630,1173,853,506,1412,5.8800848274532482,1.0121457489878543,13.543474069789859,3.0846346635820319,0.77115866589550797,26.36398689030268,14.928833047429181,10.107098150122862,22.903240762205016,10.47800083453104,5.7953544438777875,20.260559135796747,9.9545212637282887,7.6201074072282164,14.187914267743965,10.317383521215346,6.1202767429483771,17.078716919057527]
["South West","Plymouth",42980,35882,93930,137,74,395,145,59,307,662,531,852,629,526,778,1309,1109,1598,1245,1071,1526,3.1875290832945558,1.7217310376919497,9.190321079571893,3.373662168450442,1.3727315030246627,7.1428571428571432,18.449361797001281,14.798506214815228,23.74449584750014,17.529680619809376,14.659160581907363,21.682180480463742,13.935909720004258,11.806664537421485,17.012669008836369,13.25455126157777,11.402107952730757,16.246140743106569]
["South West","Poole",16010,18171,58410,18,9,56,13,7,29,166,88,380,117,62,282,374,245,775,302,219,599,1.1242973141786383,0.56214865708931916,3.4978138663335416,0.81199250468457218,0.4372267332916927,1.811367895065584,9.1354355841725834,4.8428815145011281,20.912442903527598,6.438831104507182,3.4120301579439767,15.519233944196797,6.4030131826741998,4.1944872453347033,13.268275980140388,5.1703475432288988,3.7493579866461224,10.255093305940763]
["South West","Somerset",59372,56110,212664,124,80,221,118,76,255,657,449,974,492,396,639,1148,851,1482,1037,875,1255,2.0885265781850029,1.3474365020548407,3.7222933369264974,1.98746884053089,1.2800646769520987,4.2949538502998044,11.709142755302086,8.0021386562110148,17.358759579397613,8.7684904651577256,7.057565496346462,11.388344323649973,5.3981868111198885,4.0016175751420082,6.9687394199300305,4.8762366926231051,4.1144716548169882,5.9013279163375092]
["South West","South Gloucestershire",33691,33742,107454,121,25,301,84,19,230,346,179,557,312,154,508,576,326,869,492,273,752,3.591463595619008,0.7420379329791339,8.9341367130687726,2.49324745480989,0.56394882906414179,6.8267489834080317,10.254282496591784,5.3049611759824549,16.507616620235908,9.246636239701262,4.5640448106217768,15.055420544128978,5.360433301691887,3.0338563478325611,8.0871814916150164,4.5787034451951536,2.5406220336143837,6.9983434772088522]
["South West","Swindon",24264,30676,87763,92,41,283,68,42,159,401,216,580,376,298,476,660,417,930,468,383,589,3.7916254533465215,1.6897461259479063,11.663369601055061,2.8025057698648204,1.7309594460929774,6.5529179030662714,13.072108488720824,7.041335245794758,18.907289085930369,12.257139131568653,9.71443473725388,15.517016560177337,7.5202534097512617,4.7514328361610243,10.596720713740414,5.3325433269145313,4.3640258423253533,6.7112564520355962]
["South West","Torbay",14115,13450,51063,85,25,487,66,22,458,210,90,298,202,89,312,480,212,613,472,211,674,6.0219624512929508,1.7711654268508679,34.502302515054907,4.6758767268862913,1.5586255756287637,32.4477506199079,15.613382899628252,6.6914498141263943,22.156133828996282,15.018587360594795,6.6171003717472123,23.197026022304833,9.4001527524822279,4.1517341323463173,12.004778410982512,9.2434835399408577,4.1321504807786456,13.199381156610462]
["South West","Wiltshire",52954,53888,193768,121,57,426,131,20,325,651,462,1340,443,203,692,713,523,1433,567,367,941,2.2850020772746156,1.0764059372285379,8.0447180571817043,2.4738452241568152,0.37768629376439927,6.1374022736714888,12.080611638954869,8.5733372921615203,24.866389548693586,8.2207541567695959,3.7670724465558196,12.841448931116389,3.6796581478881962,2.6991040832335575,7.3954419718426161,2.9261797613641054,1.8940175880434333,4.8563230254737624]
["West Midlands","Birmingham",179065,168941,372039,851,246,1587,523,177,1084,2961,2239,3629,2600,1874,3488,5893,4618,7520,5111,4018,6140,4.752464188981655,1.373802809035825,8.862703487560383,2.9207271102672214,0.98846787479406917,6.0536676625806267,17.526828892927117,13.253147548552453,21.480872020409493,15.389988220739784,11.092629971410137,20.646261120746296,15.83973723184935,12.412677165565976,20.212934665451741,13.737807057862213,10.799943016726742,16.503646123121502]
["West Midlands","Coventry",58601,54352,112749,167,109,293,128,59,399,536,453,659,585,446,789,1171,1020,1365,1092,876,1368,2.849780720465521,1.8600365181481544,4.9999146772239378,2.1842630671831538,1.0068087575297351,6.8087575297349874,9.8616426258463346,8.3345599057992352,12.124668825434206,10.76317338828378,8.2057697968795988,14.516485133941714,10.385901427063654,9.0466434292100146,12.106537530266344,9.6852300242130749,7.769470239203895,12.133145305058138]
["West Midlands","Dudley",36904,38676,121257,136,82,263,76,51,151,1005,730,1258,811,689,988,869,654,1123,708,588,857,3.6852373726425318,2.2219813570344678,7.1265987426837203,2.0593973553002383,1.3819640147409495,4.0916973769781055,25.98510704312752,18.874754369634914,32.52663150274072,20.969076429827282,17.814665425586927,25.545557968766161,7.1665965676208385,5.3935030554937038,9.2613209959012668,5.8388381701674952,4.8492045820035132,7.0676332088044402]
["West Midlands","Herefordshire, County of",19900,20731,73785,81,23,176,43,15,395,346,217,666,309,169,537,515,354,829,478,277,762,4.0703517587939695,1.1557788944723617,8.8442211055276374,2.1608040201005023,0.75376884422110557,19.849246231155778,16.68998118759346,10.467415947132315,32.125801939124983,14.905214413197626,8.1520428344025859,25.903236698663836,6.9797384292200313,4.7977231144541577,11.235345937521176,6.4782814935284954,3.7541505726096092,10.327302297214882]
["West Midlands","Sandwell",40307,46602,115602,194,105,397,128,42,275,981,706,1289,754,536,1048,976,669,1297,925,618,1208,4.813059766293696,2.6050065745404023,9.8494058104051412,3.1756270622968716,1.0420026298161609,6.8226362666534346,21.050598686751641,15.149564396377837,27.659757091970302,16.179563108879446,11.501652289601305,22.488305222951805,8.4427605058736006,5.7870971090465559,11.219529073891454,8.0015916679642221,5.3459282711371774,10.449646199892735]
["West Midlands","Shropshire",34300,32684,123936,106,70,236,110,40,249,462,364,599,441,352,633,634,524,795,560,460,796,3.0903790087463556,2.0408163265306123,6.8804664723032074,3.2069970845481048,1.1661807580174928,7.259475218658892,14.135356749479868,11.136947742014442,18.327010157875414,13.492840533594419,10.769795618651328,19.367274507404236,5.1155435063258459,4.2279886392977017,6.4146010844306742,4.5184611412341855,3.7115930802995094,6.4226697650400206]
["West Midlands","Solihull",24310,22875,82218,105,19,256,71,14,172,360,210,545,335,216,526,496,318,708,530,377,763,4.3192102015631431,0.78157136980666397,10.530645824763472,2.9206088029617443,0.57589469354175238,7.0752776635129573,15.737704918032787,9.1803278688524586,23.825136612021858,14.644808743169399,9.442622950819672,22.994535519125684,6.0327422218978812,3.8677661825877543,8.6112530102897171,6.4462769709795911,4.5853706001118972,9.2802062808630712]
["West Midlands","Staffordshire",102514,97889,345010,248,142,442,195,130,343,1455,1036,2062,1022,891,1184,1743,1155,2277,1462,1304,1653,2.4191817702947889,1.3851766587978227,4.3116062196382936,1.9021792145463059,1.2681194763642039,3.345884464560938,14.863774274944069,10.583415909857083,21.064675295487746,10.440396775940096,9.1021463085739978,12.095332468408095,5.0520274774644216,3.3477290513318456,6.599808701197067,4.2375583316425613,3.7796005912872093,4.7911654734645372]
["West Midlands","Stoke-on-Trent",33770,35419,92946,207,121,400,119,53,267,897,680,1115,800,640,1007,1550,1273,1852,1591,1382,1944,6.1297009179745334,3.5830618892508141,11.84483269173823,3.5238377257921232,1.5694403316553154,7.9064258217352679,25.325390327225499,19.198735142155339,31.480278946328241,22.586747226065107,18.069397780852086,28.431068070809452,16.676349708432852,13.696124631506466,19.92554816775332,17.117466055559142,14.868848578744647,20.915370214963527]
["West Midlands","Telford and Wrekin",21949,21598,66131,85,51,181,44,27,131,292,220,403,250,190,342,552,455,743,471,383,634,3.87261378650508,2.3235682719030479,8.2463893571461107,2.0046471365438059,1.2301243792427901,5.9683812474372413,13.519770349106398,10.186128345217149,18.659135105102326,11.575145846837669,8.797110843596629,15.834799518473933,8.3470686969802355,6.8802830745036365,11.235275438145498,7.1222270947059627,5.7915349835931709,9.5870318005171562]
["West Midlands","Walsall",34603,36257,100610,171,110,308,82,63,131,864,730,1070,798,688,980,871,724,1039,747,638,891,4.941768054792937,3.1789151229662167,8.9009623443054071,2.3697367280293617,1.8206513886079241,3.7857989191688581,23.829881126403176,20.134043081336017,29.511542598670601,22.009542984802934,18.975646082135864,27.029263314670271,8.6571911340820993,7.1961037670211709,10.327005267866017,7.4247092734320645,6.3413179604413079,8.8559785309611367]
["West Midlands","Warwickshire",64901,64010,219356,189,111,384,185,44,444,655,503,862,663,364,1051,1256,1033,1579,1237,823,1711,2.9121277021925702,1.7102972219226207,5.916703902867444,2.8504953698710342,0.67795565553689463,6.8411888876904827,10.232776128729887,7.8581471645055458,13.466645836588032,10.357756600531166,5.6866114669582881,16.419309482893297,5.7258520396068491,4.709239774612958,7.1983442440598848,5.6392348511096122,3.7518919017487553,7.8001057641459548]
["West Midlands","Wolverhampton",33249,35752,93434,201,136,329,141,90,251,713,520,938,698,545,922,1258,1037,1601,1065,869,1314,6.0452945953261752,4.090348581912238,9.8950344371259291,4.2407290444825412,2.7068483262654515,7.5490992210292038,19.942940255090626,14.544640859252629,26.236294473036473,19.523383307227569,15.24390243902439,25.788767061982547,13.464049489479205,11.098743498084209,17.135090010060576,11.398420275274525,9.3006828349423127,14.063403043859838]
["West Midlands","Worcestershire",65882,63280,229508,208,111,422,100,58,202,887,559,1342,849,594,1117,1675,1035,2262,1433,1040,1813,3.1571597704987706,1.684830454448863,6.4053914574542361,1.517865274278255,0.88036185908138798,3.0660878540420753,14.017067003792668,8.8337547408343866,21.207332490518333,13.416561314791403,9.3868520859671296,17.651706700379268,7.2982205413318928,4.5096467225543337,9.855865590741935,6.2437910661066285,4.5314324555135332,7.8995067710058038]
["Yorkshire and the Humber","Barnsley",28025,29954,94807,161,76,490,90,44,490,775,577,1003,586,421,781,915,683,1154,858,626,1090,5.7448706512042822,2.7118644067796609,17.484388938447815,3.2114183764495987,1.5700267618198038,17.484388938447815,25.873005274754625,19.262869733591508,33.484676503972757,19.563330440008013,14.054884155705414,26.073312412365627,9.6511860938538288,7.2041094012045521,12.17209699705718,9.0499646650563772,6.6028879724071006,11.497041357705655]
["Yorkshire and the Humber","Bradford",68992,74949,192057,404,187,762,216,108,441,1285,913,1617,1074,817,1398,3096,2406,3899,2814,2309,3296,5.8557513914656774,2.7104591836734695,11.044758812615955,3.1307977736549164,1.5653988868274582,6.3920454545454541,17.144991927844266,12.181616832779623,21.574670776127768,14.32974422607373,10.900745840504877,18.652683825001002,16.120214311376309,12.527530889267249,20.301264728700335,14.651900217123041,12.022472495144671,17.16157182503111]
["Yorkshire and the Humber","Calderdale",23670,25154,84269,75,47,166,49,33,137,433,314,565,380,281,554,1048,811,1262,923,749,1170,3.1685678073510775,1.9856358259400084,7.0130967469370509,2.0701309674693706,1.394169835234474,5.7879171947613015,17.213961994116243,12.483104078874135,22.461636320267154,15.10694124194959,11.171185497336408,22.024330126421244,12.436364499400728,9.6239423750133497,14.975851143362327,10.953019497086711,8.8882032538655977,13.884109221659211]
["Yorkshire and the Humber","Doncaster",36079,40159,118248,264,112,580,102,40,242,669,430,969,800,571,1042,1404,1009,1830,1214,935,1500,7.3172759777155685,3.1042988996369081,16.075833587405416,2.8271293550264698,1.1086781784417528,6.7075029795726042,16.658781344156974,10.707437934211509,24.129086879653379,19.920814761323737,14.218481535894819,25.946861226624168,11.87335092348285,8.5329138759217908,15.47594885325756,10.26655841959272,7.9071104796698464,12.685203978079967]
["Yorkshire and the Humber","East Riding of Yorkshire",35795,31241,138126,52,31,123,30,18,72,284,208,391,225,141,309,609,497,799,604,487,742,1.4527168598966336,0.86604274339991616,3.4362341109093451,0.83810588070959635,0.50286352842575777,2.0114541137030311,9.0906180980122269,6.6579174802343077,12.515604494094299,7.2020741973688418,4.5132998303511407,9.8908485643865429,4.4090178532644106,3.5981639951927948,5.7845735053501874,4.3728190203147852,3.5257663292935435,5.3719068097244547]
["Yorkshire and the Humber","Kingston upon Hull, City of",39033,39821,94056,137,102,200,97,73,142,913,748,1106,749,619,912,2259,1889,2580,2009,1731,2282,3.509850639202726,2.6131734686034895,5.1238695462813517,2.4850767299464556,1.8702123843926934,3.6379473778597595,22.927601014540066,18.784058662514752,27.774289947515129,18.809171040405815,15.544561914567691,22.902488636649004,24.017606532278641,20.08377987581866,27.430466955856087,21.35961554818406,18.403929573870887,24.262141702815345]
["Yorkshire and the Humber","Kirklees",56516,55629,165106,198,39,468,126,30,307,742,542,1018,729,508,1106,1547,1281,1984,1483,1071,1877,3.5034326562389411,0.69007006865312481,8.2808408238374973,2.2294571448793263,0.53082312973317292,5.4320900276028024,13.338366679250031,9.7431195958942283,18.29980765428104,13.104675618831903,9.1319275917237412,19.881716370957594,9.3697382287742421,7.7586520174917935,12.016522718738265,8.9821084636536526,6.4867418506898602,11.368454205177279]
["Yorkshire and the Humber","Leeds",126147,114091,273193,551,169,1138,300,91,736,1760,1238,2194,1372,889,1930,3206,2314,4331,3067,2342,3839,4.3679199663884196,1.3397068499449056,9.0212212735935058,2.3781778401388856,0.72138061150879529,5.8344629678073989,15.426282528858543,10.850987369731179,19.23026356154298,12.025488425905637,7.7920256637245711,16.916321182214197,11.735293364032021,8.4702023843949146,15.853261247542946,11.226495554424893,8.5726940294956311,14.052336626487502]
["Yorkshire and the Humber","North East Lincolnshire",19264,20127,61150,114,41,422,76,31,326,445,300,571,359,249,461,910,650,1106,865,633,1019,5.9177740863787376,2.1283222591362128,21.906146179401993,3.9451827242524917,1.6092192691029901,16.922757475083056,22.109604014507877,14.905351021016545,28.369851443334824,17.836736721816465,12.371441347443731,22.904556068962091,14.881439084219133,10.62959934587081,18.086672117743255,14.145543744889615,10.351594439901881,16.663941128372855]
["Yorkshire and the Humber","North Lincolnshire",18770,20241,67430,153,89,299,93,46,172,554,413,692,447,354,557,614,471,764,626,510,744,8.1513052743740015,4.74160895045285,15.929675013319127,4.9547149706979221,2.4507192328183272,9.1635588705380933,27.370189219900201,20.404130230719826,34.188034188034187,22.083889135912258,17.489254483474138,27.518403240946594,9.1057392851846366,6.9850215037816996,11.330268426516387,9.2837016164911752,7.5633990805279545,11.033664541005487]
["Yorkshire and the Humber","North Yorkshire",63864,60970,243990,172,110,315,92,56,192,573,451,729,483,324,758,1208,1031,1460,1223,914,1572,2.6932230990855568,1.7224101215082048,4.9323562570462229,1.4405611925341351,0.87686333458599519,3.0063885757234123,9.3980646219452186,7.3970805314088892,11.956700016401509,7.9219288174512057,5.3140888961784487,12.432343775627357,4.9510225828927412,4.2255830156973646,5.9838517972048031,5.0125005123160786,3.7460551661953359,6.44288700356572]
["Yorkshire and the Humber","Rotherham",30833,31600,101927,86,58,181,65,47,144,803,629,1090,625,500,857,1015,816,1323,924,738,1145,2.7892193429118151,1.8811014173126197,5.8703337333376577,2.1081308987124183,1.5243408036843642,4.6703207602244348,25.411392405063292,19.905063291139239,34.493670886075947,19.778481012658229,15.822784810126583,27.120253164556964,9.9581072728521391,8.0057295907855615,12.979877755648651,9.065311448389533,7.2404760269604713,11.233529879227291]
["Yorkshire and the Humber","Sheffield",100056,78084,197858,379,68,950,233,47,594,1088,798,1443,931,552,1385,2201,1599,2833,2081,1541,2632,3.7878787878787881,0.67961941312864793,9.4946829775325821,2.3286959302790438,0.46973694730950666,5.9366754617414248,13.933712412273961,10.219763331796527,18.480098355617027,11.923057220429282,7.0693099738742893,17.737308539521543,11.124139534413569,8.0815534373136284,14.318349523395566,10.517643966885341,7.788413913008319,13.302469447785786]
["Yorkshire and the Humber","Wakefield",38103,42556,132224,221,134,425,95,64,184,921,774,1114,831,710,979,1492,1285,1737,1417,1264,1616,5.8000682360968954,3.5167834553709683,11.153977377109413,2.4932420019421042,1.6796577697294177,4.829016087972076,21.642071623272862,18.187799605226054,26.177272300028196,19.527211204060531,16.683898862675065,23.004981671209698,11.283881897386253,9.7183567279767669,13.136798160696999,10.716662633107454,9.5595353339787028,12.221684414327202]
["Yorkshire and the Humber","York",36374,27774,73442,125,72,285,61,40,163,325,261,442,355,292,471,476,384,637,442,361,568,3.436520591631385,1.9794358607796778,7.8352669489195579,1.6770220487161158,1.0996865893220433,4.4812228514873258,11.701591416432635,9.3972780298120551,15.914164326348383,12.781738316411031,10.513429826456399,16.958306329660832,6.4813049753547016,5.2286157784374065,8.673511069959968,6.0183546199722233,4.9154434792080828,7.7339941722719967]
["East of England","East of England",706038,757046,2340906,2960,2129,3955,1843,1252,2887,8068,7038,9633,6075,5349,7204,14882,13143,16589,13909,12256,15574,4.1924089071693027,3.0154184335687315,5.6016814958968215,2.6103410864571028,1.7732756593837726,4.0890150388505999,10.657212375469918,9.2966609690824598,12.724457958961542,8.0246114502949624,7.0656208473461319,9.5159343025390797,6.3573676174951066,5.6144928502041518,7.0865724638238357,5.9417165832374303,5.235579728532457,6.6529796583032379]
["East Midlands","East Midlands",607316,568907,1801656,3192,2256,4765,1549,1115,2190,8211,7259,9674,7454,6680,8747,13654,11951,15092,13160,11777,14644,5.2559129020147664,3.7147053593187072,7.8459978001567556,2.5505667560215768,1.8359470193441305,3.606030468487575,14.432938951357603,12.759554725113244,17.004536769630185,13.102317250446909,11.741813688353281,15.375096456890143,7.5785832589573152,6.6333417700160293,8.3767378456264687,7.304391071325492,6.536763954939234,8.1280777240494295]
["London","London",1040689,1687764,3187325,6089,5553,7645,3653,3316,4932,14994,14113,16314,10986,10220,12114,31404,29887,33359,26111,24528,27467,5.8509314502219203,5.3358880510892304,7.3460947506892067,3.510174509387531,3.1863505812014923,4.739167993511991,8.8839434897296066,8.3619510784683175,9.6660433567726294,6.5092038934353385,6.0553489705906749,7.1775437798175572,9.8527762308518891,9.3768285317625288,10.466143239236663,8.1921360388413476,7.695481320543089,8.6175711607696108]
["North East","North East",347722,328020,1016635,1727,1470,2422,1152,929,1627,6842,6336,7611,5945,5470,6667,9106,8479,9975,8317,7795,9146,4.966611258419082,4.2275150838888536,6.9653343763121116,3.3129914126802444,2.671674498593704,4.6790251982905886,20.858484238765929,19.315895372233399,23.202853484543624,18.123894884458263,16.675812450460338,20.324980184135114,8.9570003000093443,8.3402597785832668,9.8117810226875921,8.1809105529516497,7.6674519370275469,8.9963457878196209]
["North West","North West",920374,932361,2740238,3580,2923,4920,2042,1705,3246,11035,10317,12182,8495,7783,9559,34199,32301,36418,32110,30295,34027,3.8897230908304667,3.1758828476249872,5.3456529628172893,2.2186632825351431,1.8525077848787559,3.5268271376636018,11.835544386777224,11.065456405834221,13.065754573604002,9.1112777132462632,8.3476250079100272,10.252466587512776,12.480302805814677,11.787662239557294,13.290086481539195,11.717960264765324,11.055609038339005,12.417534535321385]
["South East","South East",1081147,1084735,3474951,4196,3181,5433,2741,2033,3935,10390,9153,12356,9031,7593,10762,18148,16510,20110,16867,15012,19522,3.8810633521621019,2.9422455965747489,5.0252185872966395,2.5352704118866352,1.8804103419793978,3.6396530721539255,9.5783762854522081,8.4380055958367706,11.39080051809889,8.3255357299248196,6.9998663267987116,9.9213171880689757,5.2225196844502264,4.7511461312691887,5.7871319624363045,4.853881392859928,4.3200609159668728,5.617920943345676]
["South West","South West",662309,635342,2091396,2405,2033,3435,1687,1375,2648,8284,7678,9619,7112,6491,8166,15933,14983,17607,14746,13811,16343,3.6312355713118802,3.069564206435365,5.1864009095452426,2.5471494423297885,2.0760702330785179,3.9981338015941201,13.038646901983499,12.084829902635116,15.139877420349984,11.193971121065506,10.216544790050083,12.852920159536124,7.618356351451375,7.1641143045123927,8.4187786531101718,7.0507928675391938,6.6037230634466164,7.8143976559197776]
["West Midlands","West Midlands",750255,739066,2148581,2949,2301,3948,1945,1498,2886,12414,11412,13768,10915,10058,12213,19459,17724,21581,17410,16139,18953,3.9306635743847091,3.0669572345402565,5.2622108483115744,2.5924518996874397,1.9966544708132568,3.8466921246776096,16.796876057077448,15.441110807424506,18.628918120979723,14.768640419123596,13.609068743522229,16.524911171668023,9.0566750799713862,8.2491653793829514,10.044303659019604,8.1030224133974933,7.5114691975773775,8.8211708099438653]
["Yorkshire and the Humber","Yorkshire and the Humber",721521,692350,2037883,3092,2403,4311,1725,1363,2616,11570,10639,12441,9946,9187,10984,22000,20413,23649,20550,19160,21879,4.2853915547849608,3.330464393967743,5.9748780700769624,2.3907828046584925,1.8890649059417537,3.6256740968038352,16.7112009821622,15.366505380226764,17.969235213403625,14.365566548710913,13.269300209431647,15.864808261717339,10.795516720047225,10.016767400287454,11.604689768745311,10.083994027135022,9.4019136525502205,10.736141378086966]
["ENGLAND","ENGLAND",6837371,7425591,20839571,30190,28906,34829,18337,17992,22522,91808,89650,96413,75959,74042,80381,178785,174685,184519,163180,159605,168569,4.4154397940377965,4.2276483168750092,5.0939169455628486,2.6818787513504825,2.6314207609913227,3.2939561126637709,12.363729701784006,12.073113103051327,12.983882360340072,10.229354134909935,9.9711928653221005,10.824862290422406,8.5791113454302881,8.3823702512878029,8.854260963433461,7.8302955468709028,7.658746909905199,8.0888901215864752]

{"sheet":"OCU","index":6,"n_rows":165,"n_cols":15,"rows_kept":165,"cut":false,"hidden":false,"merged":[[3,11,3,14],[4,14,5,14],[4,13,5,13],[4,12,5,12],[4,11,5,11],[3,0,5,0],[4,2,5,2],[4,10,5,10],[4,9,5,9],[4,8,5,8],[3,2,3,4],[4,4,5,4],[4,3,5,3],[3,8,3,10],[3,1,5,1],[3,5,3,7],[4,5,5,5],[4,6,5,6],[4,7,5,7]]}
["National and local estimated number of OCU users with 95% confidence intervals (CI) - 2010 - 2015"]
[]
[]
["Region","Local authority","2010/11",null,null,"2011/12",null,null,"2014/15",null,null,"Difference between 2014/15 and 2011/12"]
[null,null,"OCU","Lower bound  95% CI","Upper bound  95% CI","OCU","Lower bound  95% CI","Upper bound  95% CI","OCU","Lower bound  95% CI","Upper bound  95% CI","Difference","Lower bound  95% CI","Upper bound  95% CI","Significance"]
[]
["East Midlands","Derby",2528,2247.7736673102827,2967.6001021858951,2374,2124.5483601636665,2713.6367189194325,2317,2092,2836,-57,-477,491]
["East Midlands","Derbyshire",3607.2256687786366,2569.2878781637564,4570.1156640448798,3715.3817331454902,2772.6031977568632,4696.0536783721891,4043,2950,5071,328,-1105,1638]
["East Midlands","Leicester",2704,2393.0074537737319,3191.9672834397584,2859.0347748689978,2423.7413966545805,3281.2407473869443,2798,2266,3305,-61,-754,608]
["East Midlands","Leicestershire",2089,1959.2327063072175,2266.0385318746698,1851,1697.0644404454906,2053.6736260951661,2700,1813,3720,849,-42,1863]
["East Midlands","Lincolnshire",3039.1838101601675,2127.3067312262292,3953.5202165940264,3066.9661410102799,2177.0390272952477,3864.5806616058762,3100,2830,3571,33,-806,1071]
["East Midlands","Northamptonshire",2929,2756.9263852678691,3166.5345252070001,3123.6937357739375,2283.3500103437659,3945.1937032254864,3415,2371,4426,291,-1149,1545]
["East Midlands","Nottingham",2706.1608809657914,2260.2813983967981,3167.7550379006479,2614.5180922926829,2216.4934129803278,3010.6559372812076,2700,2367,3360,85,-480,844]
["East Midlands","Nottinghamshire",4546.633494915638,3495.6471129529336,5627.6275543418478,4435.9674064484534,3488.0014006292163,5381.4368843891698,3917,3658,4246,-519,-1454,482]
["East Midlands","Rutland",58.699715137095573,8.4885768849216205,106.49005931381282,44.815178219544038,15,91.095881970986511,67,17,123,22,-50,93]
["East of England","Bedfordshire \n(Bedford UA/Central Bedfordshire UA)",2065,1802.5372680269741,2486.3259853202539,1710,1528.8309925970079,1970.735622316743,2195,1563,2849,485,-204,1155]
["East of England","Cambridgeshire",2172,2019.6507220961598,2422.1295833214444,1779,1619.2935478568706,2047.0945628407176,2227,1997,2579,448,91,812,"*↑"]
["East of England","Essex",4556.1735695845182,2650.2511167384491,6488.3560775932856,4329.4835843202745,2660.6896589643902,5952.7345033273923,5463,3370,7351,1134,-1575,3703]
["East of England","Hertfordshire",3752.9570226267888,2250.8863540105031,5214.7615235458761,3355,2972.5434529431814,4069.2772168255487,4226,2589,5921,871,-968,2589]
["East of England","Luton",1793,1610.3361899354527,2051.7320696907336,1604,1407.1268487305124,1996.7868206981861,1715,1389,2038,111,-370,469]
["East of England","Norfolk",4201.2495982366727,3064.3134445206847,5367.0273997233362,3926.0423675099901,2912.6271436149823,4870.6502616879334,3981,3619,4461,55,-961,1208]
["East of England","Peterborough",1445,1348.874639982753,1593.1172133508639,1291,1186.8820065984189,1437.473483782635,1537,1279,1816,246,-54,529]
["East of England","Southend-on-Sea",1192,1016.6894976565467,1637.5341644862067,1052,918.15120747526964,1289.7701745744639,1033,933,1192,-19,-271,196]
["East of England","Suffolk",2275,2105.6160190051464,2498.2059490767674,2398,2168.0489362792623,2844.5503680871507,2851,1862,3822,453,-672,1482]
["East of England","Thurrock",399,350.31549298026658,516.86568510050768,507.19362069567603,320.99204502063878,705.82989587935742,682,507,972,175,-97,521]
["London","Barking and Dagenham",993.60163547236789,745.06854206360651,1266.4182342241211,1079,915.10394185783923,1327.0207412583807,1150,1002,1398,71,-198,361]
["London","Barnet",1456,1279.28409139627,1789.7302381246186,1492,1267.1085783927078,1840.6530589125312,1668,1384,2529,176,-252,1027]
["London","Bexley",715,596.34750815379505,945.9598226121177,605,492.71991623628696,807.7488540487426,724,587,1485,119,-113,829]
["London","Brent",1857.7062414244099,1491.220852795401,2226.6419388320996,1833.8074002679398,1396.0727203900572,2233.39023780251,1890,1400,2431,56,-585,828]
["London","Bromley",1012.4657553003346,595.00512063211636,1414.5685706658578,1117,912.56456396675082,1417.9506460671639,1221,964,1668,104,-271,599]
["London","Camden",2344.5077266310595,1971.0822834717744,2730.3836075742829,2211.6534172982615,1924.3291659343538,2514.2549201239035,2097,1721,2479,-115,-576,390]
["London","City of London",45.929171555763432,24.510980480096947,67.267084653583638,30.018222000712683,20.169321752104807,40.980423324509488,28,14,43,-2,-21,16]
["London","Croydon",1675.7925921365309,1185.3235401568943,2193.8246416117877,1913.8782536832914,1463.7975622396991,2407.9620032486823,2028,1803,2418,114,-409,746]
["London","Ealing",2385.3982250678546,1890.3416154627996,2869.9474681797419,2583,2329.0603534899547,2988.4969392206267,2464,1928,2986,-119,-781,437]
["London","Enfield",1497.8980333864495,1062.6120606376589,1903.9862198667463,1545.1273296496311,1107.7250656296083,1956.1637591979509,1789,1523,2294,244,-237,912]
["London","Greenwich",1746,1603.4518177516854,1956.4120395594273,1887.8123984609322,1535.4126132211838,2264.8693413735286,1447,1031,1885,-441,-1015,92]
["London","Hackney",2246.2595313497654,1907.224984631589,2570.2541180482363,2616.6056170937763,2239.5750254801596,2996.6441497183723,2553,2132,2980,-64,-632,504]
["London","Hammersmith and Fulham",1548.229313980054,1301.8640240998418,1807.200128104148,1390.0128661309077,1135.5922235119961,1639.2104346462058,1500,1181,1804,110,-306,529]
["London","Haringey",1866.2071217184885,1529.6206020015354,2191.6928959565912,1846.8970653630411,1505.943246761884,2184.1740700412602,1856,1426,2294,9,-525,539]
["London","Harrow",854.96049575867414,549.33807795304313,1159.5738500767691,898.30372968415065,568.87561234526868,1206.4517453636538,1193,976,1508,295,-86,754]
["London","Havering",871,728.92550512602247,1082.4704367237064,852,676.42540122385799,1475.4753946464512,894,725,1149,42,-583,321]
["London","Hillingdon",1362.3010881213625,993.50130042392925,1725.0534314006786,1225.6312637682267,852.50916407090426,1590.9054204321235,2046,1749,2625,820,356,1499,"*↑"]
["London","Hounslow",1557.9813699357803,1215.8771012155667,1887.1459067807368,1280,1150.4890675183858,1496.6979987287409,1536,1092,1961,256,-239,672]
["London","Islington",2329.8298981534708,2029.6826474976947,2644.9464320580159,2623,2316.5367162882594,3229.1207213933799,2168,1809,2548,-455,-1177,28]
["London","Kensington and Chelsea",1563,1372.8550015542801,1853.0413885026169,1065.0595665228007,832.6849825587783,1282.7763056322713,1250,1053,1982,185,-82,920]
["London","Kingston upon Thames",544,471.26064936621617,683.23827973530001,522,429.24385228971465,766.28844263048757,553,441,877,31,-213,363]
["London","Lambeth",2671.6983306075444,2215.9597069956167,3131.4787921707907,3074.0875478425946,2593.6358172675978,3495.4339248431611,2387,1806,2967,-687,-1428,82]
["London","Lewisham",2084.5387207552085,1679.2138488463395,2508.7706293923661,2438,2188.4779735774546,2867.2702260370224,1940,1445,2430,-498,-1135,52]
["London","Merton",842,717.00268970192406,1020.9165121743371,795,642.54047142182856,1161.3051244989681,635,339,959,-160,-612,190]
["London","Newham",2464.5923189447558,2066.8931938937935,2841.0796418509181,2924,2568.3941095088821,3775.7953430938182,2400,1880,2951,-524,-1612,174]
["London","Redbridge",1432,1259.8479429510455,1671.638691470197,1504,1239.9361154490116,2300.0030455781794,1133,695,1570,-371,-1269,116]
["London","Richmond upon Thames",630.95988473267676,361.17180582762973,909.04006024720672,649,505.69379642653485,929.61332234401596,822,586,1214,173,-209,606]
["London","Southwark",2545.7060651866477,2055.9372466986797,2989.8016901750216,2828.7651722135365,2419.5573596962799,3258.556935586455,2257,1774,2728,-572,-1213,34]
["London","Sutton",1044,871.69049169502182,1398.556606162326,807,667.83013404196254,1121.1546492835657,836,670,1157,29,-333,395]
["London","Tower Hamlets",3026.6344320090261,2611.4526542885919,3395.9527725243461,3560.5698659322466,3173.6453007097712,3966.7769550302146,2798,2342,3245,-763,-1369,-153,"*↓"]
["London","Waltham Forest",1463.3012691087997,1145.4173722348173,1769.1136103892004,1602.9143151562873,1286.3812245747988,1935.3998165596345,1478,1038,1959,-125,-647,446]
["London","Wandsworth",1687.9924626783959,1262.4524259422699,2094.1779507402653,1633.5536149765999,1197.7377191504213,2084.2229930236776,1497,953,2007,-137,-829,573]
["London","Westminster",2255.292316722851,1836.8295674061376,2623.5154812590672,2550,2280.043408480778,3004.901929119113,2249,1946,2733,-301,-852,229]
["North East","County Durham",2376,2241.8610377905702,2614.0025049305987,2155,2013.8950840922344,2350.7927160451718,2311,2168,2584,156,-96,464]
["North East","Darlington",779,678.75095563954187,1374.1505533098427,717,644.45237679786965,837.50029454897378,806,652,951,89,-101,258]
["North East","Gateshead",1565,1462.889458044307,1746.2325661133516,1749,1596.8564712612604,1967.4218327839485,1762,1591,2118,13,-243,396]
["North East","Hartlepool",1101,1014.7128046853537,1305.2402315288723,1018,943.67348567446447,1132.132205507844,1044,931,1327,26,-138,323]
["North East","Middlesbrough",2392,2126.4799038480692,2996.1877163910135,1895,1762.0868390630289,2080.0617601743465,2174,1957,2401,279,-1,545]
["North East","Newcastle upon Tyne",2238.1437271976797,1823.85403826636,2668.1213730975805,2221,2007.9758463862258,2563.7556535769581,2051,1582,2527,-170,-718,314]
["North East","North Tyneside",1133,1002.6557864813919,1365.6443157360632,975,848.77989598406339,1256.6326707958488,1108,922,1490,133,-184,498]
["North East","Northumberland",1302,1184.8605218256328,1498.7066367503749,1324,1159.2979750298978,1660.9732579744064,1256,1105,1764,-68,-415,491]
["North East","Redcar and Cleveland",1055,969.12054610925532,1197.3813371475144,1054,935.56259278002722,1232.4327967143734,1197,968,1809,143,-131,766]
["North East","South Tyneside",829,733.59630691512007,975.66583532745301,816.57106536622166,627.96154473533988,1003.3843224812374,715,620,884,-102,-325,160]
["North East","Stockton-On-Tees",1971,1738.7350772338164,2494.4466369835445,1739.3278814763728,1476.7537033506364,1977.3382362741713,1898,1665,2298,159,-155,617]
["North East","Sunderland",1549,1418.7438143243915,1770.4671831169487,1271,1158.6360938378309,1479.8462695956146,1353,1197,1589,82,-166,335]
["North West","Blackburn with Darwen",1297,1214.6907044436982,1442.8153994594566,1417,1212.4332720987488,1906.531598487757,1363,1157,1576,-54,-529,254]
["North West","Blackpool",1945.6254255747081,1732.2883570515328,2136.7126258898547,1822.4210631111307,1638.6308153025996,2013.8596013691183,1762,1548,1974,-60,-349,222]
["North West","Bolton",2406,2257.6896195368658,2634.1492453649662,2126,1985.2137540246272,2379.5613223394339,2748,2373,3421,622,153,1302,"*↑"]
["North West","Bury",1107,987.63022641712689,1273.6825406144314,856.28669607958443,616.80349360031312,1077.3336812729344,1168,917,1646,312,-11,824]
["North West","Cheshire \n(Cheshire West, Cheshire East and Cheshire UA)",3388.9934952886151,2482.633974811602,4241.8646727561536,3116,2857.7193521849586,3581.6155989674298,3284,2360,4247,168,-934,1114]
["North West","Cumbria",2599.2665522302273,1985.4456816987804,3263.5690695568337,2386,2203.1509650192143,2686.1221808479336,2744,2466,3261,358,-49,915]
["North West","Halton",818,711.48383684684632,1025.9223872285656,701,595.76578812659579,876.26987562615523,699,595,878,-2,-208,204]
["North West","Knowsley",1354,1176.8273565914324,1587.5866621882583,923.40671831527141,747.89786870781882,1106.1748712914803,1090,880,1317,167,-94,446]
["North West","Lancashire",6523.3656100969538,4955.380628344682,8040.0666211091739,6393.6691177334851,4994.8336247321877,7735.3481512045973,6711,5126,8342,317,-1774,2519]
["North West","Liverpool",5430.9011335586474,4801.6822203333695,6114.1731073493011,5406.6957058442513,4769.2374098161599,6045.6686176165622,5257,4518,5997,-150,-1131,849]
["North West","Manchester",4847.743019061586,4135.6225387098712,5572.682827915798,4708.7264554268331,3982.9981793982856,5440.8707219002981,4314,3489,5126,-395,-1500,692]
["North West","Oldham",1537,1393.6758197395632,1824.3450264913267,1249.7789485141,971.31774496334185,1521.1166193534939,1662,1450,1999,412,71,830,"*↑"]
["North West","Rochdale",1683.167899976592,1417.5233510807832,1981.5886888409591,1447.7440861327602,1162.9338832176143,1714.5028054231254,1830,1559,2456,382,20,1045,"*↑"]
["North West","Salford",1745,1590.1826935553258,2040.3205925566299,1562,1399.5873386828423,1790.6422825434322,1399,1013,1756,-163,-592,222]
["North West","Sefton",1915.1350170973319,1569.9907938838021,2312.8647268167351,1894.9769981159191,1538.4776050930623,2224.7895024275413,1686,1536,1978,-209,-567,254]
["North West","St. Helens",1150,1073.4380156015829,1321.3243665255543,1232,1090.7192416715955,1452.6630575853585,1386,1209,1631,154,-147,441]
["North West","Stockport",1489,1320.5083412048095,1774.1178435207771,1251,1113.3175638741893,1535.2188949239762,1518,1307,2033,267,-87,815]
["North West","Tameside",1436,1315.7410574151638,1697.2415566165355,1439.0534030154131,1155.880154176818,1707.7704120898643,1396,1250,2003,-43,-348,582]
["North West","Trafford",883,755.03754774890308,1124.0327741598094,821,678.85585148498797,1093.5252648609278,858,512,1174,37,-415,417]
["North West","Warrington",967,853.32797460597749,1125.6425939140543,821,712.89550992707552,1018.1052229160736,947,814,1142,126,-123,355]
["North West","Wigan",1844,1723.7637091640677,2027.2261127118888,1869.239594482224,1472.0960029501639,2285.25039249662,2155,1665,2629,286,-324,919]
["North West","Wirral",3059,2859.4906686185718,3452.1133943880263,2892,2671.280419009669,3197.4476283439903,2837,2565,3404,-55,-462,528]
["South East","Bracknell Forest",305,251.31416324883719,436.70480892564052,227,181.72867148614353,331.53452861134502,372,183,544,145,-64,323]
["South East","Brighton and Hove",2290,2034.9571558513876,2840.9690760265817,2029.3893989395124,1630.4430070246422,2407.9423119222097,2128,1889,2489,99,-337,636]
["South East","Buckinghamshire",1666,1474.5730076888196,1984.2991714242853,1568,1368.4080873282812,1830.4504348910441,1647,940,2339,79,-674,802]
["South East","East Sussex",2264,2007.2090319077308,2825.8786422903622,2152,1849.5095007711084,2641.1078210808705,2296,1547,2980,144,-803,874]
["South East","Hampshire",4088.4502007730348,2344.1434699446722,5815.4550335840222,4042.5753872964287,2400.1717981012539,5562.3757289515224,3215,2955,3633,-828,-2315,924]
["South East","Isle of Wight",697,568.75339332291185,913.06826813473947,574,463.81729765451632,781.72962733574229,544,352,733,-30,-310,189]
["South East","Kent",4617,4392.8071562428604,4947.7990331251485,5028,4557.6611907656252,5851.4833962558278,5198,3163,7156,170,-2168,2178]
["South East","Medway",1467,1305.6573847552002,1713.7260251841424,1291,1155.2625441132677,1508.8675761701786,1259,831,1648,-32,-513,373]
["South East","Milton Keynes",932.44839704490425,573.80689087841245,1285.78495108534,949.23637898887205,612.11683107489841,1255.2402446080687,1006,608,1427,57,-466,565]
["South East","Oxfordshire",2881.6482623136849,2035.8608269977674,3798.500596641813,3258,2870.7480284471735,3947.5933023420193,2933,1974,3948,-325,-1467,798]
["South East","Portsmouth",1283,1138.6502645147687,1527.2703492198557,1549,1291.3553338100887,1917.2875329852864,1427,1253,1795,-122,-512,311]
["South East","Reading",1363,1227.2413346539067,1668.2531634723373,1259.8330964040097,1049.2887310545177,1479.4814973108632,1332,1113,1904,72,-209,643]
["South East","Slough",1066,942.23406165356721,1291.8594789799113,1044.7476233626357,860.7114170671241,1236.204486492958,887,688,1103,-158,-450,132]
["South East","Southampton",1554.0179354104789,1236.3470256301994,1919.4941783790496,1648.736638625842,1324.1720501749903,1969.0058941595837,1483,1105,1872,-166,-659,332]
["South East","Surrey",2962,2594.9875317336641,3543.7925304279102,2610,2400.1442733975168,2931.505255851921,2966,2664,3468,356,-92,864]
["South East","West Berkshire",541,455.17284822046963,677.36289421843628,616,474.32438935535401,844.86318189099984,524,438,716,-92,-323,173]
["South East","West Sussex",2336.1484625609396,1220.7128863730688,3342.705491909684,2139.7001663785295,1227,3055.7838388960377,2646,1524,3732,506,-989,2057]
["South East","Windsor and Maidenhead",500,431.41256027748273,643.65537283319964,582,447.5379658369144,817.95749416542901,531,428,687,-51,-297,160]
["South East","Wokingham",355.78896636595169,114.14923075897403,571.51562976671551,366,257.78876507574154,609.50036918003445,340,253,644,-26,-260,301]
["South West","Bath and North East Somerset",1032.9508969453498,785.49436501493653,1274.5847582366248,1234,997.45305599068968,1729.7655206431293,1007,809,1608,-227,-741,378]
["South West","Bournemouth",1921,1812.3085347291974,2102.2668582023603,1893.0411358414221,1652.6549062458596,2127.8830247795131,1854,1638,2439,-39,-373,619]
["South West","Bristol, City of",4989.1531741794452,4264.1758314587851,5628.7591237025081,5364,4913.0805278639355,5982.0102020154409,4709,4006,5420,-655,-1598,207]
["South West","Cornwall (UA) and \nIsles of Scilly (UA)",2260,2038.4151936056255,2591.5545623824564,1882,1728.9312512322367,2174.2798825450109,2111,1843,2665,229,-146,773]
["South West","Devon",2117,1956.7292711839161,2368.2660564586226,2200,1985.3435113121993,2595.7367818117182,2147,1949,2471,-53,-469,333]
["South West","Dorset",1436,1296.0846133985301,1677.1838415210248,1386,1225.9675014195325,1604.3373593057911,1647,1415,2340,261,-47,942]
["South West","Gloucestershire",2956.112302411871,2155.572101506255,3763.2763582908433,2644.4662335093903,1903.7571938532967,3357.133055580437,2829,1981,3658,185,-926,1311]
["South West","North Somerset",1166,1050.3069449860238,1410.108017240007,989,886.23507503327141,1144.718575700545,1267,1038,1772,278,-8,806]
["South West","Plymouth",2371.552136650897,2024.9665069860796,2702.9379872438162,2084,1927.5258854317647,2284.7922317266462,2108,1925,2530,24,-233,472]
["South West","Poole",546,466.29376154416065,680.63942903443399,533,426.8772461752539,718.77908780639609,558,421,1118,25,-190,608]
["South West","Somerset",2056,1874.4547379879441,2364.8954226719156,1844,1689.0481924120179,2054.0575621602529,1929,1730,2325,85,-191,477]
["South West","South Gloucestershire",1250,1005.5501148117171,1794.9271650833487,896.30549894275669,574.53211549660659,1211.9500971641548,1043,655,1429,147,-346,664]
["South West","Swindon",1017,910.43761792192834,1225.7153693350924,1147,974.266175858118,1398.2241482221957,1153,828,1492,6,-408,385]
["South West","Torbay",915,832.74384649111914,1044.7054076074496,814,733.74396449552387,962.83695206459947,775,672,946,-39,-215,141]
["South West","Wiltshire",1345,1174.8772828851854,1748.2020973848707,1140,996.08067987889592,1379.6762121230493,1485,1236,3105,345,9,1957,"*↑"]
["West Midlands","Birmingham",10262.833838092458,8864.7947454800033,11716.296294616672,10743.27704160734,9283.9567247295672,12084.789824954405,9705,8184,11470,-1038,-3145,1137]
["West Midlands","Coventry",2124.4830268090559,1724.0261204239177,2583.3097631618621,1935.1437063795752,1502.8669079613232,2356.8400895299201,1874,1698,2157,-61,-518,463]
["West Midlands","Dudley",1912.5924219876124,1518.5281064294977,2278.8039711503966,1921,1635.7223724195285,2379.2167230332611,2010,1565,2450,89,-494,622]
["West Midlands","Herefordshire, County of",847,764.11598619471067,1029.5525629557051,719,644.3551980662827,851.74327726089314,942,776,1468,223,-11,764]
["West Midlands","Sandwell",2046.6805788292977,1681.0095812861045,2442.2971656045047,2141.1983193406818,1751.6765076423751,2527.9432494524744,2151,1728,2624,10,-560,573]
["West Midlands","Shropshire",1123,1020.1445711203912,1274.2866596193719,863,794.40104623991772,983.58491557077309,1202,1059,1460,339,175,613,"*↑"]
["West Midlands","Solihull",897,783.97086734772085,1065.8434193467947,740,671.8065103169165,946.63105587881239,961,678,1261,221,-115,505]
["West Midlands","Staffordshire",3023,2833.707664575501,3337.9592346390318,3239.768939087025,2202.2116839994037,4305.8369550782418,3446,3143,3939,206,-869,1389]
["West Midlands","Stoke-on-Trent",2221,2117.2906919812963,2381.1635181029255,2344,2148.6743336231279,2718.3966807849392,2654,2282,3036,310,-235,707]
["West Midlands","Telford and Wrekin",1019.6286231466248,784.69247083477399,1238.5534767709105,767,671.30172914700074,1181.9807688232679,929,824,1202,162,-224,436]
["West Midlands","Walsall",2106.9617703057511,1767.7276114646756,2452.7368786015495,2186,1904.4620001040814,2649.9910718525462,1906,1740,2227,-280,-751,136]
["West Midlands","Warwickshire",2186,2008.5064249371694,2516.5653544752522,1805,1622.0176863458487,2115.3065175018141,2100,1843,2574,295,-102,805]
["West Midlands","Wolverhampton",2135,1995.2347274447432,2375.5455346754898,2281.5383802135184,1948.0330908041619,2609.3527457795044,2172,1951,2602,-110,-507,395]
["West Midlands","Worcestershire",2592.4530439391247,1825.9669516886847,3380.6371823822938,2643,2314.199712047428,3337.9857658411247,2770,1906,3589,127,-978,989]
["Yorkshire and the Humber","Barnsley",1509,1384.5872412915885,1746.0765125516339,1718,1542.5658057127876,2117.972453164633,1851,1608,2247,133,-302,543]
["Yorkshire and the Humber","Bradford",4682.5933299432045,4001.3454172158899,5381.9190761866375,4441,4107.2913189600522,4892.1528912765125,4785,3963,5579,344,-578,1169]
["Yorkshire and the Humber","Calderdale",1115,1036.067690951309,1268.2690050851288,1058,972.46385900938276,1181.5597197141969,1556,1248,1848,498,170,803,"*↑"]
["Yorkshire and the Humber","Doncaster",2443,2315.4773989726004,2654.1869509072098,2276,2135.1814833411722,2489.2578186829273,2337,1890,2808,61,-438,534]
["Yorkshire and the Humber","East Riding of Yorkshire",1128,973.33836142419307,1339.1270909222978,1161,975.90540774367071,1589.9847947425876,945,817,1225,-216,-624,120]
["Yorkshire and the Humber","Kingston upon Hull, City of",3315.5404122673121,2915.976894278956,3707.9703653541687,3228.7584588835384,2883.2846885079598,3575.8152243775944,3309,2832,3731,80,-529,641]
["Yorkshire and the Humber","Kirklees",2341,2205.1283236857403,2538.2056695057977,2524.2362547690495,1996.4540426357491,3052.7749014913561,2487,2227,3022,-37,-622,704]
["Yorkshire and the Humber","Leeds",5215.0629499150418,4104.271634645057,6336.0992801553502,5476.2022872974267,4471.6827896693276,6438.5169350041251,5517,4337,6703,41,-1484,1574]
["Yorkshire and the Humber","North East Lincolnshire",1302,1231.0058058584464,1440.2695795578798,1586.8046261766515,1397.4061798622779,1774.740809614173,1469,1222,1693,-118,-421,159]
["Yorkshire and the Humber","North Lincolnshire",1065,997.79919482268099,1218.5261099256913,1195.8134250710993,980.29369218742102,1378.6778894370136,1321,1066,1558,125,-181,429]
["Yorkshire and the Humber","North Yorkshire",1803,1692.501510917092,1990.8567975299902,2066.3605941424157,1367.0896453634957,2776.2028760012913,1953,1735,2295,-113,-855,666]
["Yorkshire and the Humber","Rotherham",1689,1587.668294703725,1970.8969805859692,1649,1470.345613032297,2356.1943007664545,1904,1699,2382,255,-430,719]
["Yorkshire and the Humber","Sheffield",4017.2402090480814,3147.679268754946,4866.210178554531,4266,3876.6256873200127,4808.3020068358101,3668,2812,4601,-598,-1611,368]
["Yorkshire and the Humber","Wakefield",2767.2217925519326,2320.62633137895,3217.5461056729605,2501,2298.3863241788458,2873.6848495694362,2634,2408,3019,133,-293,553]
["Yorkshire and the Humber","York",915,852.10822810951538,1002.3437242597744,1122,947.62659044468182,1511.6647034067983,926,835,1213,-196,-583,145]
["East of England","East of England",23851.380190447977,21263.553155953716,26737.731881320669,21951.719572525937,20102.789528264715,24378.692081592777,25910,23146,28708,3958,270,7606,"*↑"]
["East Midlands","East Midlands",24207.903569957329,22398.198441233133,26054.306440511024,24085.377061759391,22134.280288619426,25947.32317904244,25057,23108,27064,972,-1741,4009," "]
["London","London",52622.784000738284,50844.194045129625,54659.709323327988,54984.69764604493,53830.990103186843,57863.873793321407,52487,50955,55550,-2498,-5341,634," "]
["North East","North East",18290.143727197679,17729.015331352621,19689.398062731718,16934.898946842593,16467.384207997271,17762.108524199994,17675,17116,19120,740,-178,2152," "]
["North West","North West",49426.198152884659,47464.731210356287,52032.252901834974,46336.998786770979,44528.917887359275,48642.890986370163,48814,46661,52097,2477,-670,6105," "]
["South East","South East",33169.502224468997,30989.706498462641,35950.092702822803,32935.218689995832,30923.332874229382,35390.134521068241,32734,30175,35974,-201,-3744,3424," "]
["South West","South West",27378.768510187565,26333.915364956127,29106.450201582968,26050.812868293571,25033.809363726705,27561.003616678419,26622,25586,29474,571,-1122,3638," "]
["West Midlands","West Midlands",34497.633303109928,32692.533681484285,36590.594219209248,34328.92638662814,32486.706721658731,36644.285805469801,34822,33090,37580,493,-2268,3840," "]
["Yorkshire and the Humber","Yorkshire and the Humber",35307.658693725571,33840.676485321339,37294.050378171421,36270.175646340183,34926.012063462811,38300.980777318095,36662,34971,38800,392,-2269,2846," "]
["ENGLAND","ENGLAND",298752,294857.89316965669,307224.80958769628,293878.82560520165,291028.75595559453,302145.61377959704,300783,297986,311128,6904,-593,16618," "]

{"sheet":"Opiate","index":7,"n_rows":165,"n_cols":15,"rows_kept":165,"cut":false,"hidden":false,"merged":[[3,11,3,14],[4,14,5,14],[4,13,5,13],[4,12,5,12],[4,11,5,11],[3,0,5,0],[4,2,5,2],[4,10,5,10],[4,9,5,9],[4,8,5,8],[3,5,3,7],[4,5,5,5],[4,6,5,6],[4,7,5,7],[3,8,3,10],[3,1,5,1],[3,2,3,4],[4,4,5,4],[4,3,5,3]]}
["National and local estimated number of opiate users with 95% confidence intervals (CI) - 2010 - 2015"]
[]
[]
["Region","Local authority","2010/11",null,null,"2011/12",null,null,"2014/15",null,null,"Difference between 2014/15 and 2011/12"]
[null,null,"Opiate users","Lower bound  95% CI","Upper bound  95% CI","Opiate users","Lower bound  95% CI","Upper bound  95% CI","Opiate users","Lower bound  95% CI","Upper bound  95% CI","Difference","Lower bound  95% CI","Upper bound  95% CI","Significance"]
[]
["East Midlands","Derby",1948.0346875264361,1693.5888126376053,2218.6783303547982,2094,1941,2316,1989,1828,2357,-105,-361,256]
["East Midlands","Derbyshire",3208.061126524492,2431.2388070465149,3962.9452445777342,3330.9740782493109,2490.0252102342233,4190.7300055410587,3481,2628,4329,150.02592175068912,-974,1398]
["East Midlands","Leicester",2439,2174.97807735167,2849.8350704667528,2532.5936454086109,2125.7019237601612,2896.5130173905573,2298,1869,2747,-234.59364540861088,-795,326]
["East Midlands","Leicestershire",1848,1745.5172963134232,1991.8197473326979,1665,1527.0297443929785,1877.3139972426648,2285,1561,3047,620,-99,1370]
["East Midlands","Lincolnshire",2710.4256914806224,2029.1148362275396,3405.8287442464584,2762.0219597707141,2036.8412151921709,3498.6817152836634,2929,2664,3403,166.97804022928585,-635,1085]
["East Midlands","Northamptonshire",2582,2437.5779682721968,2841.4785400832329,2752.7776033018317,2002.6855749236388,3469.7980754777182,2908,2158,3700,155.22239669816827,-902,1313]
["East Midlands","Nottingham",2393.0347903618481,2045.2328247137161,2769.857410005543,2289.5623524867856,1940.6437475748658,2664.7488386607251,2400,2124,2937,110.43764751321442,-349,731]
["East Midlands","Nottinghamshire",3580,3396.2125767429488,3843.0866793607288,4000.4495965237293,3178.5594139546029,4793.4814650403296,3818,3256,5214,-182.44959652372927,-1195,1419]
["East Midlands","Rutland",47.928234313576702,20,93.633086605668367,37.794500967052713,15,77.022625283428667,55,17,96,17.205499032947287,-42,72]
["East of England","Bedfordshire \n(Bedford UA/Central Bedfordshire UA)",1787,1610.4882872226447,2107.8017353997247,1534,1376.250656702143,2020.8809089528552,1829,1375,2282,295,-360,748]
["East of England","Cambridgeshire",2035,1879.0807283994827,2348.0147539989543,1687,1552.728065928746,1939.9799105837903,1954,1764,2440,267,-44,762]
["East of England","Essex",3831.4120103268219,2266.4731936909957,5391.0995760955157,3711.1757752083122,2281.8574249190542,5115.635006252136,4492,2879,6002,780.82422479168781,-1495,2678]
["East of England","Hertfordshire",3124.5052579335725,1932.3808663593175,4288.4630694062253,2814,2552.6940254538035,3247.4079082592384,3418,2957,4100,604,-22,1314]
["East of England","Luton",1545,1361.6381201813604,1911.420226288054,1355,1189.12433796695,1629.8302010955672,1411,1177,1652,56,-318,343]
["East of England","Norfolk",3694.6931784543776,2801.4699726612712,4563.6508078498209,3464.0732996468014,2591.6490962700782,4338.5199890802687,3531,3277,3965,66.926700353198612,-802,1082]
["East of England","Peterborough",1330,1244.4956805305869,1447.6552324924976,1228,1136.1592084140884,1350.3617652845967,1352,1160,1564,124,-103,366]
["East of England","Southend-on-Sea",850,772.50937124705331,1160.3231280600869,925,815.11684773564707,1125.4277085818453,931,810,1203,6,-217,286]
["East of England","Suffolk",2029,1893.5079306439764,2288.9460698627718,2143,1936.2489526507748,2573.4838763923476,2391,1633,3148,248,-576,1011]
["East of England","Thurrock",359,309.40384026895384,443.45266772277967,401.94335901219347,228,572.11321820801038,518,397,767,116.05664098780653,-107,446]
["London","Barking and Dagenham",820,724.49462997819944,971.25556211931621,758,659.12754932955534,985.17788271051529,861,771,1088,103,-134,352]
["London","Barnet",1125,1001.5342930475261,1332.145801269754,1156,979.50637459201312,1586.8343644905101,1390,1100,1850,234,-341,681]
["London","Bexley",627,506.17736302886544,944.16797377523915,445,366.96504229193715,605.4904572762963,541,411,825,96,-121,378]
["London","Brent",1317.0892313189236,1036.3694765674925,1596.3580313558875,1362.1596126628522,1017.8810722945312,1702.1248239031431,1410,1042,1809,47.840387337147831,-485,552]
["London","Bromley",827.87246426315767,519,1180.2731656082312,814,674.78807981051068,1004.9158534115629,870,687,1182,56,-233,415]
["London","Camden",1963.6007012336829,1654.5404986759445,2266.0458358318738,2055,1824.8590665709171,2426.8525893862279,1718,1425,2010,-337,-793,34]
["London","City of London",34.83598687418079,23,52.062271527298257,25.87551492723896,17.518919256967362,35.176861936731214,23,13,33,-2.8755149272389602,-18,10]
["London","Croydon",1307.2987538096315,918.79862623245424,1694.1882219717356,1469.7103328406238,1063.4070919752849,1855.5997830125234,1486,1306,1772,16.289667159376222,-407,489]
["London","Ealing",2060.4237953132183,1651.5245336462062,2430.9656980962432,2236,2019.3211564225094,2542.8037496655847,2029,1616,2441,-207,-722,247]
["London","Enfield",1360,1170.6428730173059,1846.4705782320361,1343,1155.3282693221126,1592.8522345092383,1368,1129,2009,25,-312,713]
["London","Greenwich",1614,1376.7556774494583,2243.1540603552085,1464,1276.7493503454375,1776.4219845742748,1111,804,1432,-353,-770,33]
["London","Hackney",1792.3383336692336,1520.9578052779882,2066.831881933937,1984.5070334339364,1683.6087493726468,2275.396055868966,1989,1657,2297,4.4929665660636147,-425,433]
["London","Hammersmith and Fulham",1220.7506501957744,1032.1963214358436,1422.5596446545717,1140.8674522380973,933.40556697880982,1339.6858159353976,1178,936,1413,37.132547761902742,-283,369]
["London","Haringey",1407.3503370245098,1148.3957431613494,1690.8981222418433,1400.162119688425,1098.3782866369274,1702.282235463141,1406,1067,1737,5.8378803115749633,-452,432]
["London","Harrow",703.19628986279247,463.60233862194298,974.08164941167001,736.96368816865436,476.71411043319409,995.6102102426845,1002,792,1538,265.03631183134564,-62,864]
["London","Havering",620,517.08097176862759,770.17236717878427,712,547.73951530519173,1496.6550853549904,746,582,1231,34,-640,508]
["London","Hillingdon",1296,1112.0351415688137,1755.1292679834296,1049.7570227166464,729.8331926581775,1336.8360771101627,1344,1004,1689,294.24297728335364,-177,715]
["London","Hounslow",1353.1767534243616,1074.6555216419079,1624.0147235246259,1140,1033.456091380102,1337.8124882286131,1280,967,1577,140,-230,451]
["London","Islington",1911.0592953411092,1660.9498052418533,2157.4237797079131,1930.6916217916214,1641.6806620384909,2200.1391021321283,1749,1444,2019,-181.6916217916214,-564,225]
["London","Kensington and Chelsea",1166,1019.2320562059228,1445.1992522792618,808.5969487504251,629.9679439926316,988.66187670939451,794,610,972,-14.596948750425099,-279,246]
["London","Kingston upon Thames",442,335.90175119142833,743.58787020777982,439,367.68875262731166,612.77390112021726,450,365,722,11,-170,270]
["London","Lambeth",2087.9236262308759,1743.8850665155608,2439.7046049214778,2290.113861261947,1925.3851018600067,2653.723835629291,1818,1406,2209,-472.11386126194702,-1018,98]
["London","Lewisham",1670.9037829223807,1357.938223800483,1982.7152789671952,1875.0594578114299,1526.4919708155212,2198.516746905857,1486,1107,1842,-389.05945781142987,-911,67]
["London","Merton",640,548.25498913673823,806.85741716236998,594,492.40312194302652,931.34999381740818,492,248,731,-102,-557,146]
["London","Newham",2095.0867478285154,1778.9327478523378,2417.5701298436543,2466,2173.076093506817,2977.8632766143219,1877,1481,2322,-589,-1210,-30,"*↓"]
["London","Redbridge",1017,900.33288265916531,1185.1279778186797,1308,1077.4220116636077,1958.8420493592032,895,549,1208,-413,-1151,-37,"*↓"]
["London","Richmond upon Thames",504,429.11436471470671,668.22170336061538,520,404.74676401586498,882.37077727210112,628,460,1000,108,-284,438]
["London","Southwark",2052.9701284135226,1719.555978562373,2401.1433129791726,2239.4414068549363,1870.6619028718364,2597.4394591183823,1791,1418,2195,-448.4414068549363,-921,59]
["London","Sutton",733,639.44594078565137,943.9821271896493,670,541.35176225255532,1015.9347398092083,736,561,1022,66,-292,345]
["London","Tower Hamlets",2638.9924599129436,2320.3486185235488,2955.7851571590868,3046.6903483939823,2656.1713881137957,3410.4787101286347,2309,1937,2672,-737.69034839398228,-1286,-220,"*↓"]
["London","Waltham Forest",1011.2720085456012,743.73024900843416,1260.2662244420765,1149.2408486583897,863.85517599611978,1456.8108118349824,1330,1150,1703,180.75915134161028,-171,686]
["London","Wandsworth",1290.1093429227597,941.01938852604258,1652.8729619196947,1261.982642570599,891.64716167485926,1658.5154228232202,1140,729,1510,-121.98264257059895,-678,460]
["London","Westminster",1877.7420842319077,1565.161018376433,2185.3833024859696,2026,1759.9279012498387,2578.2365900122991,1503,1241,1790,-523,-1141,-128,"*↓"]
["North East","County Durham",2186,2047.9589313719023,2543.2745055045666,1992,1876.0164613124798,2175.21443681243,2001,1886,2206,9,-196,252]
["North East","Darlington",755.43076619041346,641.85974305775289,856.02130435702929,635,578.56037918551795,766.23459961123467,656,583,854,21,-134,230]
["North East","Gateshead",1456,1366.786559887787,1621.9191170309514,1656,1519.4133965537155,1819.3893903431333,1615,1436,1862,-41,-296,240]
["North East","Hartlepool",1043,962.7007796773089,1250.6651309766826,903,845.13057905335222,987.55310456794939,918,841,1125,15,-94,229]
["North East","Middlesbrough",2048,1887.2199877878588,2339.0968435479499,1696,1600.8136613988943,1868.583384380096,1936,1756,2113,240,-2,442]
["North East","Newcastle upon Tyne",1993.369572694043,1654.0648891534195,2332.1974978987814,2021.1265056806271,1717.2807386508487,2337.7447619123081,1783,1447,2121,-238.12650568062713,-695,245]
["North East","North Tyneside",961,865.58927705049359,1144.1283007369998,920,824.88188761251274,1205.8791786365516,934,808,1607,14,-255,680]
["North East","Northumberland",1207,1105.0517691678776,1400.6965514098229,1278,1119.6317294472731,1620.1804017552136,1092,995,1414,-186,-544,190]
["North East","Redcar and Cleveland",940,853.97942944206784,1221.7056628202076,923,828.22930048122248,1085.2458095480849,953,826,1256,30,-184,360]
["North East","South Tyneside",745,662.08090222208898,861.96700009108088,602,555.26633448554981,697.56683107974595,588,524,699,-14,-132,109]
["North East","Stockton-on-Tees",1890,1672.9115014330732,2280.9530380475617,1563,1456.2035109405783,1716.4987969918272,1657,1491,1974,94,-123,404]
["North East","Sunderland",1230,1148.0715944868143,1360.8729531795038,1087,1002.8940118327871,1306.6376554445767,1281,963,1574,194,-196,475]
["North West","Blackburn with Darwen",1201,1126.3509482736683,1330.9665953599772,1409,1201.0620139988459,1917.4897763069698,1210,1053,1376,-199,-729,66]
["North West","Blackpool",1801.656904442418,1646.2048290638629,1957.1031762596572,1681.7017233695483,1524.9836154680277,1851.3023701439813,1559,1406,1717,-122.70172336954829,-351,96]
["North West","Bolton",2001.3176789594474,1717.3931546582096,2292.7765240400613,1874.7661568936767,1595.4317549033087,2173.8762205189714,2546,2192,3145,671.23384310632332,197,1344,"*↑"]
["North West","Bury",831,754.3214524687628,956.46738725460148,765.29659735244115,583,975.64962227091905,735,650,871,-30.296597352441154,-246,198]
["North West","Cheshire \n(Cheshire West, Cheshire East and Cheshire UA)",2974,2769.107532995276,3262.1927439433261,2608.7528373424038,1995,3342.9787988082667,2885,2185,3660,276.24716265759616,-740,1375]
["North West","Cumbria",2344.1545778394843,1815.6110733401638,2840.0451155001442,2361,2171.7316869901124,2592.2842582797989,2687,2390,3295,326,-58,947]
["North West","Halton",699,615.18335306045992,858.53455332070098,621,536.88053310391831,776.36231118081378,647,483,1120,26,-210,478]
["North West","Knowsley",1228,1035.0293043186052,3056.0632382143954,826.49858496253682,669.48003800796005,975.94285455179363,949,776,1108,122.50141503746318,-111,358]
["North West","Lancashire",5854.3972329651888,4559.7211619046839,7100.5530924298355,5749.448658660599,4550.5221304549041,7064.8979200377271,5890,4602,7163,140.55134133940101,-1680,1808]
["North West","Liverpool",4902.6570100582485,4377.222432337413,5388.2641354734096,4853.7036919014981,4323.9141138835303,5390.2918839768099,4594,3978,5181,-259.70369190149813,-1069,491]
["North West","Manchester",4322.6972451370921,3670.9518446906218,4983.5014205957423,4229.0965231286427,3635.0768357047159,4832.5687282974386,3754,3092,4396,-475.09652312864273,-1360,414]
["North West","Oldham",1198.5005669346988,971.35764411624552,1411.3401436235836,1125.8993933425634,898,1358.8489579410243,1315,1150,1834,189.10060665743663,-101,806]
["North West","Rochdale",1505.8503598509435,1279.8211463306668,1740.1232433251496,1305.8030137277892,1086,1538.8917871998242,1412,1257,1686,106.19698627221078,-170,445]
["North West","Salford",1417.8933298147601,1138.8730078527037,1700.175458613618,1415,1273.7878143404721,1615.4663491566682,1207,939,1471,-208,-528,109]
["North West","Sefton",1733.0712163021819,1435.7800453144823,2000.7859818239442,1708.1409677999623,1437.4935395737641,1999.0692332248861,1615,1441,2218,-93.140967799962255,-410,578]
["North West","St. Helens",1000,948.94243146877943,1089.8801010315019,1154,1028.5554762367924,1352.3735915842321,1138,1019,1399,-16,-233,282]
["North West","Stockport",1350,1201.959821932486,1571.9273322285428,1122,999.59764656498021,1355.3037417275091,1243,1056,1551,121,-188,425]
["North West","Tameside",1331,1188.7203504265212,1591.5983080596714,1293.7993830837238,1048.5560002726695,1533.0241611102465,1198,1104,1327,-95.799383083723797,-356,183]
["North West","Trafford",728,617.490792348431,964.32216033325142,671.73347084476279,453,919.65754572980086,732,483,988,60.266529155237208,-281,405]
["North West","Warrington",777,712.32505501298499,876.33328060606925,732,650.56140574295671,908.29015539071884,802,705,950,70,-114,234]
["North West","Wigan",1622,1531.2177020893726,1766.4480350681599,1771,1528.0995924249914,2351.3311407773135,1867,1527,2226,96,-600,527]
["North West","Wirral",2881,2705.2455360482522,3144.9402512968391,2793,2584.9833416484348,3083.9365572802981,2662,2281,3020,-131,-593,263]
["South East","Bracknell Forest",260,217.2662656740379,341.02350559603201,173,145.72532400443907,328.85391876400786,236,188,343,63,-100,165]
["South East","Brighton and Hove",1884.0630861624957,1559.2848861465495,2187.6706960006127,1795.0836820090071,1484.3199477770195,2103.4717773518082,2098,1757,3598,302.91631799099287,-148,1850]
["South East","Buckinghamshire",1420,1237.9127574437589,1710.0005515371704,1248,1115.0934864139076,1556.179575668999,1394,763,1914,146,-541,675]
["South East","East Sussex",1864.5487760251981,1365.40133168786,2368.4709324782652,1672,1529.8471234418309,1868.9508173176248,1981,1434,2506,309,-297,835]
["South East","Hampshire",3540.1675262628164,2168.4717723361546,4876.5024413040037,3509.1998858234915,2188.6634351416151,4889.5011586950977,2828,2616,3266,-681.19988582349151,-2002,799]
["South East","Isle of Wight",572,476.3604122244106,728.20808197672079,483,408.25780606209253,621.47311705292293,481,342,610,-2,-205,157]
["South East","Kent",4290,4008.5205513419978,4723.8996349534682,4101.4281339584622,2622.3670611915545,5660.2853326642344,4401,2759,6086,299.57186604153776,-2094,2535]
["South East","Medway",1272,1145.2642211851628,1428.6496884102885,1251.9553805992723,954.67699795721342,1539.0269231472998,1208,1038,1516,-43.955380599272303,-386,382]
["South East","Milton Keynes",846,693.89053333329082,1140.6685039965441,804.71299931759836,528.30707728477023,1068.6632362788396,846,550,1146,41.28700068240164,-347,459]
["South East","Oxfordshire",2509.599684257917,1786.0781760333521,3211.6811565569119,2532.0976103061189,1833.1141154582501,3209.0209717228422,2811,2384,4128,278.9023896938811,-499,1826]
["South East","Portsmouth",1188,1049.9547430684986,1423.3682327978215,1476,1248.5944899240183,1829.5741469790739,1315,1043,1611,-161,-661,215]
["South East","Reading",1154.7456346021931,973.20586423037275,1346.9725764696179,1111.1379095781115,928.9261126619092,1289.5378517694335,1157,999,1601,45.862090421888524,-191,555]
["South East","Slough",989,873.88654398195331,1213.7061095662509,911.23481533644281,744.75513900644012,1064.1999682750759,758,593,924,-153.23481533644281,-386,85]
["South East","Southampton",1505,1299.1183234212047,1998.9009445810752,1441.4200537958218,1188.0432890260208,1703.6626810446558,1273,995,1592,-168.42005379582179,-556,200]
["South East","Surrey",2601,2306.3063760672289,3213.6470646367443,2413,2205.3928148456407,2758.8691950618104,2409,2183,2824,-4,-398,442]
["South East","West Berkshire",489,414.94237953672274,607.81494530207431,532,424.47668478243565,727.35306455455793,488,406,643,-44,-253,142]
["South East","West Sussex",2124,1787.2251306233113,2748.9005377449503,1840.4813297354679,1172,2641.5070965198047,2230,1336,3095,389.51867026453215,-771,1622]
["South East","Windsor and Maidenhead",451.98394234092393,288.79777071555128,594.82802928556646,432,328.34421866193389,659.41160069296996,448,359,701,16,-210,314]
["South East","Wokingham",299,236.77642966035489,429.01643026766737,340,235.69776203801104,554.93851854531476,277,203,468,-63,-293,149]
["South West","Bath and North East Somerset",904.83488826401128,716.79933654902572,1100.2980690742772,839,727.33756213962249,1523.6184782515038,984,782,1599,145,-574,722]
["South West","Bournemouth",1831,1675.2992377726669,2628.0114354128154,1688.9823608829174,1472.0081629501983,1882.4650104802756,1510,1393,1873,-178.98236088291742,-399,253]
["South West","Bristol, City of",4449.4015159130895,3967.6488313610544,4960.6546484983119,4238.789607682822,3770.0124023510466,4733.1994414629971,4116,3598,4670,-122.78960768282195,-863,585]
["South West","Cornwall (UA) and \nIsles of Scilly (UA)",2111,1920.1770365478583,2367.3675180835626,1751,1610.6825028678884,2016.8902936078205,2093,1824,2608,342,-50,876]
["South West","Devon",2031,1896.0285987988862,2256.3532807536449,2095,1911.0230447399556,2446.12374124801,2113,1918,2414,18,-382,389]
["South West","Dorset",1334,1199.4771489163409,1517.8523766663959,1281,1141.6308365488881,1479.3219275637221,1389,1204,1910,108,-169,626]
["South West","Gloucestershire",2619.0567457066663,2014.2514521515689,3264.1525917225008,2290.0182558087986,1635.8582950249611,2906.6987464263007,2418,1743,3070,127.98174419120141,-777,1069]
["South West","North Somerset",1111,989.68375156997683,1419.7920773610015,907,818.75551880693536,1110.2095977021347,1143,937,1912,236,-42,1036]
["South West","Plymouth",2161.0209180890602,1851.3567823587032,2462.6524675124688,2063,1913.128427480118,2258.2794070298323,2019,1841,2404,-44,-303,381]
["South West","Poole",440,380.77475752261324,689.97999146742529,502,403.87225882933649,711.80084256677708,432,343,869,-70,-277,366]
["South West","Somerset",1747,1621.6786569817409,1988.0124450035082,1753,1604.2123746784873,1952.320201648912,1647,1496,1960,-106,-351,261]
["South West","South Gloucestershire",819.77015601186713,529.45864876410008,1125.1259991766372,768.09341373664643,496.67217347250266,1044.8871683422799,888,603,1209,119.90658626335357,-263,569]
["South West","Swindon",988,862.45749557644297,1390.0097750796392,1068,906.08402194935638,1328.5712612582849,912,822,1099,-156,-417,92]
["South West","Torbay",888,806.96376213883184,1020.9329656212359,771,696.02993363505709,908.23948068589414,740,654,1024,-31,-184,264]
["South West","Wiltshire",1197,1047.0021535204155,1601.2429571899172,1066,927.63276056641621,1284.0158000177298,1141,970,1491,75,-189,471]
["West Midlands","Birmingham",9127.9157702218999,7964.3491115382867,10305.640661984336,9408.1208334903458,8167.3992600845595,10577.218126129988,8234,6933,9398,-1174.1208334903458,-2954,616]
["West Midlands","Coventry",1859.6012262430238,1517.7304634482723,2208.7404578520182,1697.6592459687672,1344.4540311057181,2074.2156649549966,1805,1605,2198,107.34075403123279,-285,675]
["West Midlands","Dudley",1761,1579.7156093386407,2132.223065506128,1808,1552.7091354742106,2179.8950156846481,1595,1460,1846,-213,-576,146]
["West Midlands","Herefordshire, County of",767,697.96854577945157,903.29380959670596,684,616.05694272877747,809.77723556860929,830,711,1281,146,-31,629]
["West Midlands","Sandwell",1852.7752363558261,1539.0292301604318,2157.8238106603908,1895.1461125994099,1595.5148773576393,2236.1368975887467,1807,1458,2157,-88.146112599409889,-557,388]
["West Midlands","Shropshire",966,882.91616741353153,1083.2483826769858,802,743.73858211366053,904.179807423292,1111,995,1484,309,164,707,"*↑"]
["West Midlands","Solihull",732,663.53688208082758,893.06306822930924,642,584.31792322147783,781.15312832841562,936,736,1310,294,34,662,"*↑"]
["West Midlands","Staffordshire",2779,2571.3396221998419,3147.5901854974063,2864.2990306182983,1930.515115406226,3823.8594611381322,2679,2506,2965,-185.29903061829827,-1157,787]
["West Midlands","Stoke-on-Trent",2057,1965.7842315632872,2189.7834359927069,2068,1944.4086926550019,2267.6973038317005,2510,2258,2991,442,128,930,"*↑"]
["West Midlands","Telford and Wrekin",910.50403102668508,720.06388846728407,1079.9070279164278,684.7748585117514,521,864.08086521921268,765,691,1002,80.225141488248596,-112,375]
["West Midlands","Walsall",1888.5047046880165,1588.4154279769909,2167.951742579964,2027.3672363943351,1740.8043103864861,2324.1830505292896,1627,1491,1879,-400.36723639433512,-734,0]
["West Midlands","Warwickshire",2044,1827.2674049252678,2457.4416599041247,1710,1523.1987456376951,1995.7016521159785,2085,1766,2552,375,-63,883]
["West Midlands","Wolverhampton",2012,1828.5491456757852,2341.8400896995281,1986.9954704265954,1698.1661903016832,2253.7067698293313,1904,1708,2247,-82.995470426595375,-433,373]
["West Midlands","Worcestershire",2288.4820472799634,1686.7401801406922,2878.256941376731,2428,2135.0534595435843,3072.292361714437,2382,1752,2996,-46,-962,590]
["Yorkshire and the Humber","Barnsley",1391,1263.6231620307419,1604.4681216252334,1603,1441.1447867862594,1866.2187762613387,1534,1355,1930,-69,-371,344]
["Yorkshire and the Humber","Bradford",4250.9686640293039,3655.9467676438335,4783.8454548541413,4215.4331923441787,3656.6603712970227,4768.7669158153403,4104,3512,4698,-111.43319234417868,-958,738]
["Yorkshire and the Humber","Calderdale",1043,980.16461204979748,1194.2213690109922,1038,959.77193220110814,1160.1037205725174,1352,1181,1710,314,110,664,"*↑"]
["Yorkshire and the Humber","Doncaster",2271,2160.0222836733346,2466.8655523088328,2150,2040.0651751103994,2342.873776876193,2116,1777,2479,-34,-432,323]
["Yorkshire and the Humber","East Riding of Yorkshire",1026,903.08776617537376,1272.1701301733467,1012,871.21858393112041,1457.6985534924102,859,751,1027,-153,-596,51]
["Yorkshire and the Humber","Kingston upon Hull, City of",2909,2757.7205665355518,3167.9356927884101,2922.2779093232302,2624.8688976852773,3202.8200005451781,2855,2499,3186,-67.277909323230233,-519,389]
["Yorkshire and the Humber","Kirklees",2288.0788435629097,1847.8145024827354,2714.5019137537606,2260.637245073739,1788.4342262769401,2680.5196087648146,2338,1875,2820,77.362754926261005,-569,761]
["Yorkshire and the Humber","Leeds",4644.4647585696403,3694.0836133682478,5563.7372196285633,4898.169060797868,4075.5774367536892,5782.1438203250264,4739,3888,5655,-159.16906079786804,-1358,985]
["Yorkshire and the Humber","North East Lincolnshire",1227,1165.4266246253171,1366.971881379229,1442.4095327749008,1277.7166138709144,1617.2928247612736,1300,1114,1482,-142.40953277490075,-393,118]
["Yorkshire and the Humber","North Lincolnshire",947,895.85679300793788,1062.8675960998705,1084.8712903010223,915.94221390053315,1264.1016680941154,1166,979,1340,81.128709698977673,-175,340]
["Yorkshire and the Humber","North Yorkshire",1718,1602.9797785716644,1886.5445024645333,1839.9562950357524,1214.0725359666267,2454.8365869310755,1798,1622,2178,-41.956295035752419,-676,644]
["Yorkshire and the Humber","Rotherham",1677,1540.5040476887941,2084.7639365023397,1532,1424.7071376863537,1866.539109472569,1614,1466,1916,82,-258,400]
["Yorkshire and the Humber","Sheffield",3972,3622.6219710748792,4555.4805516137185,3004.1163655785554,2445,3669.3237367635234,3245,2553,3861,240.88363442144464,-708,1161]
["Yorkshire and the Humber","Wakefield",2516.1811092995581,2171.960150832937,2840.7326152105079,2469,2250.0201396749285,2909.0409654121822,2343,2167,2638,-126,-609,203]
["Yorkshire and the Humber","York",884,828.74937051640461,1017.6017649059066,840,776.91756117560828,968.60184144392281,858,780,1073,18,-137,244]
["East of England","East of England",20585.610446714771,18570.52724887295,22915.85418120446,19263.192433867305,17815.05282725755,21344.851430722927,21827,20086,23861,2563.8075661326948,-40,4987]
["East Midlands","East Midlands",20756.484530206977,19593.520683648934,22060.024184490769,21465.173736708031,19749.184659109051,23155.458167868968,22163,20635,24262,697.82626329196864,-1368,3591]
["London","London",42587.992773339087,41537.168195823346,44635.227845932495,43917.819912769803,42928.045818879145,46537.96430012436,40750,39407,42995,-3167.8199127698026,-5974,-1064,"*↓"]
["North East","North East",16454.800338884455,16042.15217666149,17400.396190614741,15276.126505680628,14868.402158671477,16071.859520628504,15414,14945,16643,137.87349431937218,-679,1347]
["North West","North West",43704.196122304471,42060.983961994112,46042.912962462498,42072.641002410142,40550.445136381459,44403.109850963359,42647,41029,45239,574.35899758985761,-2134,3704]
["South East","South East",29260.108649651545,27811.849778254204,31327.630669310234,28067.751800459795,25830.977189757559,30520.705721049992,28639,26645,32162,571.24819954020495,-2807,4618]
["South West","South West",24632.08422398469,23904.789106659086,26379.962279845291,23081.883638111183,22243.572058065325,24551.946187557107,23545,22834,25830,463.11636188881675,-907,2837]
["West Midlands","West Midlands",31045.783015815414,29721.850177673907,32896.898679609541,30706.362788009505,28970.614102988511,32659.219768552484,30270,28991,32519,-436.36278800950458,-2592,2479]
["Yorkshire and the Humber","Yorkshire and the Humber",32764.693375461415,31700.302749787406,34468.631037602834,32311.870891229253,30942.465057608482,34253.70203446594,32221,30834,34026,-90.870891229253175,-2277,2232]
["ENGLAND","ENGLAND",261792,259260.28940525456,269025.23246214713,256162.82270924564,253751.09521088257,263500.67178696848,257476,255440,266643,1313.1772907543636,-5134,9419]

{"sheet":"Crack","index":8,"n_rows":165,"n_cols":15,"rows_kept":165,"cut":false,"hidden":false,"merged":[[3,11,3,14],[4,11,5,11],[4,12,5,12],[4,13,5,13],[4,14,5,14],[3,0,5,0],[3,5,3,7],[3,2,3,4],[3,8,3,10],[4,4,5,4],[4,3,5,3],[4,2,5,2],[4,10,5,10],[4,9,5,9],[4,5,5,5],[4,6,5,6],[4,7,5,7],[4,8,5,8],[3,1,5,1]]}
["National and local estimated number of crack users with 95% confidence intervals (CI) - 2010 - 2015"]
[]
[]
["Region","Local authority","2010/11",null,null,"2011/12",null,null,"2014/15",null,null,"Difference between 2014/15 and 2011/12"]
[null,null,"Crack users","Lower bound  95% CI","Upper bound  95% CI","Crack users","Lower bound  95% CI","Upper bound  95% CI","Crack users","Lower bound  95% CI","Upper bound  95% CI","Difference","Lower bound  95% CI","Upper bound  95% CI","Significance"]
[]
["East Midlands","Derby",919.82455741535398,625.67800668495158,1211.4176453801579,1058,914.73593609078353,1298.7020142860424,1010,556,1418,-48,-549,390," "]
["East Midlands","Derbyshire",2026,1602.3293999385028,2595.8542800468458,2347,1776.7579144971821,3177.4382218707369,2342,1758,3206,-5,-1027,1054," "]
["East Midlands","Leicester",991,872.33964540919499,1142.5870079019464,1108.8936555327805,722.97588709523552,1537.8732484942846,1526,1180,2121,417,-138,1108," "]
["East Midlands","Leicestershire",1177,912.1597096179371,1563.1037675277325,879,677.69160697625443,1214.3528462175279,1478,377,2541,599,-567,1723," "]
["East Midlands","Lincolnshire",1250.5393828466681,487,2043.4080131394396,1156.6612418114821,468,1971.218380364531,1438,348,2588,281,-1131,1655," "]
["East Midlands","Northamptonshire",1279.7462864527192,585,2136.0134330187161,919,789.23656365001511,1112.0515090334782,1146,977,1368,227,-29,486," "]
["East Midlands","Nottingham",2315.2198729548927,1896.9322220151016,2781.0144051527241,2144.1163743540783,1721.2744439315484,2543.2092663528433,1391,1268,1547,-753,-1188,-334,"*↓"]
["East Midlands","Nottinghamshire",2119.5319867627459,1205.151066226269,3112.7403094792039,2050.4997607782616,1103.3698595648511,2955.4731190177081,1946,1516,2429,-104,-1166,969," "]
["East Midlands","Rutland",30.893926483710551,2,76.572264191406617,23.909332051094648,2,70.704079207279406,54,5,114,30,-46,104," "]
["East of England","Bedfordshire \n(Bedford UA/Central Bedfordshire UA)",1036.7826095314356,516.95866801541274,1530.9921118873992,1262.4574490739399,781.9737082980123,1705.896631449463,1690,989,2470,428,-371,1346," "]
["East of England","Cambridgeshire",1195.2739838117434,479.00551267537656,2018.9941952289039,835,664.86686724665356,1143.1558023770222,1032,764,1314,197,-205,512," "]
["East of England","Essex",2704.6542180578904,1152,4502.7934939774914,2768.8573527007929,1230.612435092823,4314.0496461071971,4236,1859,6429,1467,-1285,4283," "]
["East of England","Hertfordshire",2215,2019.63438678027,2494.5540081147724,2598.2171398164833,1226.9892066153943,3938.4733213848772,3535,1585,5380,937,-1353,3413," "]
["East of England","Luton",1174.9393107907567,928.1318263257574,1435.9865339287558,1152,980.24677391181274,1410.8513667862803,1485,1238,1803,333,-22,693," "]
["East of England","Norfolk",1848.3796549297492,860.52111499463388,2792.2276382104419,1750.3966931537977,758.59507686385223,2676.5579296565052,2279,1832,2857,529,-506,1706," "]
["East of England","Peterborough",619,525.78335342667208,755.46762048103005,784,578.45533906408536,1183.2829030909049,855,520,1041,71,-528,312," "]
["East of England","Southend-on-Sea",868.77563391126523,679.62923325889813,1058.1184826718938,712,590.64981704181832,926.52661119838638,819,688,1003,107,-134,331," "]
["East of England","Suffolk",1229,1002.1266668247365,1569.6287107135709,979,770.7918484395592,1316.4785482722662,1097,930,1344,118,-260,446," "]
["East of England","Thurrock",201,164.72206942134275,282.15417365323981,321.29029567076628,136,507.9787128410664,380,254,633,59,-154,360," "]
["London","Barking and Dagenham",665,562.57829732056882,810.35094669358375,757,622.30666648360341,963.59684361879761,916,741,1168,159,-108,445," "]
["London","Barnet",1059,905.74508873249124,1293.0160059400159,857,716.65195608844533,1083.4568089197392,1030,822,1360,173,-134,520," "]
["London","Bexley",540,415.92278794898778,739.02325433991757,441.22030948234374,184,708.31035200568203,636,459,888,195,-101,564," "]
["London","Brent",1573,1407.9510029575551,1802.0550094662074,1547.697516426198,1170.5061418354428,1947.4638352132761,1487,974,2076,-61,-736,655," "]
["London","Bromley",795.9484124999567,424.56444227416699,1167.3515306070558,750.05513701144662,380.88220597396969,1094.6952723244481,837,599,1223,87,-341,574," "]
["London","Camden",1847.5540901335658,1495.3036284348425,2170.3889443493476,1860.2804546739669,1546.7276698399396,2189.6387088608917,1552,1094,1992,-308,-851,227," "]
["London","City of London",43.235736463815989,25.739306187109893,61.068575803265738,22.658251228989528,13,33.576110210942424,21,12,45,-2,-14,25," "]
["London","Croydon",1465,1265.3313639724847,1758.6091625041424,1302.0645931450626,833.48645322621735,1748.6510450215064,1231,1013,1553,-71,-561,485," "]
["London","Ealing",1335.3772446211292,926.804284213855,1721.9013941780902,1320.3876008081979,894.26094552231223,1717.9333144770626,1525,870,2104,205,-581,955," "]
["London","Enfield",1002.1914471108349,614.83397964891651,1363.9377950280959,1102.4765109030666,737.05306333971964,1477.9498248501957,1182,965,1507,80,-375,554," "]
["London","Greenwich",1231,1089.4041024372282,1407.8041838456604,1328,1141.3555275035578,1593.0024786264964,1161,664,1700,-167,-707,415," "]
["London","Hackney",1768.6931135139362,1456.1391008016742,2074.2633483723248,1895.5539509931994,1537.3467698952011,2242.7242561654311,2151,1596,2686,255,-395,921," "]
["London","Hammersmith and Fulham",1090.7757976639464,853.04812107118687,1336.2765856753433,996.52973785149447,739.68575798888287,1252.2129402551952,1240,1022,1597,243,-91,676," "]
["London","Haringey",1495.8670247293305,1175.8393178721108,1806.4685555430769,1407.8239857087196,1054.1160378755928,1750.5188657444389,1555,1014,2077,147,-481,791," "]
["London","Harrow",546.945270903655,271,819.54420612894955,627.22676858095861,326.12096887739813,922.37583794578677,760,559,1069,133,-231,553," "]
["London","Havering",680,539.44097407676816,910.0038429684289,693,508.24507165650505,994.1750717905926,601,479,802,-92,-416,185," "]
["London","Hillingdon",722.5737621967977,370.01699958158787,1065.6756543479555,739.74827538180773,408.55609132531606,1063.7459140328695,1174,928,1572,434,28,926,"*↑"]
["London","Hounslow",941.6297436299875,641.15060131266864,1246.9229199453252,1088,813.99748330464217,1574.1695295570307,1151,875,1584,63,-478,563," "]
["London","Islington",2008.7747179545652,1694.0838003087824,2298.7264836130867,1823.4294238759721,1524.2393654319462,2130.9542304831734,1642,1207,2091,-181,-723,376," "]
["London","Kensington and Chelsea",956.02181437061529,745.64720526990084,1187.1438385401843,880.85964900100601,663.96925554857455,1089.7882921614541,892,675,1289,11,-304,441," "]
["London","Kingston upon Thames",297,245.7194270830245,387.70628017014485,377,283.38160491304819,564.9016853651749,275,209,395,-102,-301,55," "]
["London","Lambeth",2312.7917163213474,1915.1582265798963,2743.5913547536738,2358.0987066020543,1916.4994257817389,2834.4875588231239,2000,1385,2628,-358,-1144,432," "]
["London","Lewisham",1562.9728359471064,1194.5901221016577,1900.3303638955435,1823,1602.2617618199927,2106.8575880751264,1593,1076,2142,-230,-852,323," "]
["London","Merton",526,443.00251130114896,654.80962119988874,643.95160653135008,405.14360875582804,885.82411690946924,518,322,911,-126,-440,332," "]
["London","Newham",1587.0684878564948,1202.0406680229689,1987.7625053928987,1884.0732242164711,1463.35475546732,2329.8334896725773,2089,1785,2460,205,-315,766," "]
["London","Redbridge",1031,867.78455085899918,1263.3185918004367,903.56484829793897,564.90101351704197,1224.0379850360373,784,262,1331,-120,-720,519," "]
["London","Richmond upon Thames",444.20649741743887,220.2294053841176,707.42248858968037,336,243.94685257991756,507.43634274788491,410,269,730,74,-153,408," "]
["London","Southwark",1995.4562664399587,1558.3383297901707,2414.4875185274341,2150.4216015766219,1742.5614245148702,2555.753182102821,1904,1316,2508,-246,-959,508," "]
["London","Sutton",769,591.13277155953438,1049.8440248000695,693,530.14417482454758,999.73671016961111,506,363,729,-187,-525,82," "]
["London","Tower Hamlets",2805.2414772812022,2442.8313125680797,3169.8163944737671,2955.2729339052598,2545.5459493343365,3334.6162449598014,2543,1982,3169,-412,-1126,370," "]
["London","Waltham Forest",1189.04652292375,891.33632315814327,1501.1520946182955,1181.4125257849348,832.1915241047717,1494.3974380308125,1172,651,1668,-9,-611,606," "]
["London","Wandsworth",1395.7293898639375,1013.7163616741535,1777.256890874907,1326.2530917278737,909.99183042341417,1745.9407211141865,1295,709,1864,-31,-769,687," "]
["London","Westminster",2250,2003.5571733117424,2602.6128573755223,2007,1744.3450362595479,2410.9622733806295,1393,1133,1794,-614,-1086,-145,"*↓"]
["North East","County Durham",525.68032108633304,208,1125.7614209409883,545.48191849027944,177,1165.5107406913753,815,145,1696,270,-870,1360," "]
["North East","Darlington",154.58601724353642,80,268.99606547095544,144.79076628180749,61,265.76726409507631,200,43,371,55,-141,274," "]
["North East","Gateshead",362.5555859016381,165,598.88014554811627,320.88483701186652,136,561.62009277726531,376,99,718,55,-372,467," "]
["North East","Hartlepool",154.911188824269,97,257.56581010961713,191.87857615339473,112,303.48150968059144,210,71,359,18,-167,201," "]
["North East","Middlesbrough",1099,949.38059564830769,1299.6902192766338,1151,967.79376171678268,1426.0221316131433,734,481,974,-417,-782,-116,"*↓"]
["North East","Newcastle upon Tyne",653.23958820946405,312,1030.4230064708111,596.93546174770358,291,935.74701086677305,1076,674,1894,479,-75,1326," "]
["North East","North Tyneside",231.4591913378537,82,486.92852802164913,217.87147576367758,67,442.8841547053367,344,71,676,126,-286,553," "]
["North East","Northumberland",344,154.35258948738723,909.7465911060483,266.75772740505477,55,633.21783567550415,451,51,949,184,-470,821," "]
["North East","Redcar and Cleveland",345.7771986769273,178,515.93565050249504,339.18412834066436,187.86388909865212,500.37995480137482,517,242,1267,178,-154,899," "]
["North East","South Tyneside",198,127.85245144421265,358.02257641994549,207.2631315231886,76,377.20221558819935,239,44,491,32,-276,345," "]
["North East","Stockton-On-Tees",777,660.72879856535701,949.80968144787334,967.47311303717595,740.68501113955938,1184.9730895859639,917,705,1248,-50,-336,346," "]
["North East","Sunderland",721,593.69795325695748,916.58692587800158,594.03171118651619,289.53218115586287,925.84988386531563,452,332,627,-142,-491,197," "]
["North West","Blackburn with Darwen",590.24124925295746,419.6450338858624,761.94152914014296,641.68642422866549,477.01975574150237,811.64394251512579,712,536,999,70,-179,390," "]
["North West","Blackpool",720.90932312571965,553.7903471756706,891.4486976367773,769.45398885029817,597.78086191815089,931.99635636259143,964,748,1298,195,-64,577," "]
["North West","Bolton",1403,1150.5997672595267,1722.5370955251219,986.69935162210334,675.86970289877115,1303.7751899114326,1084,880,1401,97,-294,525," "]
["North West","Bury",601,504.01782877896761,746.22958292518103,577,461.51765339211664,748.20317980996128,604,288,916,27,-343,361," "]
["North West","Cheshire \n(Cheshire West, Cheshire East and Cheshire UA)",2228,1865.8468952989081,2737.1727263934977,1580.9168894642876,816.58019221663938,2433.3095135401741,2023,933,3240,442,-971,1819," "]
["North West","Cumbria",460.57583586244937,113,1026.3008994073089,430.40035856117663,100,992.76132364974296,829,376,2156,399,-379,1843," "]
["North West","Halton",503,410.75326615230551,633.00178602964024,434.31861197929345,281.10955388732378,581.6849438405128,643,451,1040,209,-38,650," "]
["North West","Knowsley",617,523.09521607315355,772.67003195001803,700.18529117254786,530.43899477468426,885.15274566007929,664,432,912,-36,-322,267," "]
["North West","Lancashire",2270.7999276980227,1007,3602.8853902460228,2192.0207559312475,974,3594.7201118032413,2690,817,4717,498,-1801,2990," "]
["North West","Liverpool",4237.4999662868613,3634.2953602651323,4910.886882668302,3999.3556305282777,3323.0478373995106,4645.7294211553308,3649,2702,4568,-350,-1475,729," "]
["North West","Manchester",3692.50666363444,2967.3144208750291,4372.6925135826259,3433.3760823428479,2778.125820917759,4075.8563344853492,4037,3499,4668,604,-224,1482," "]
["North West","Oldham",1029,811.05813696617975,1306.5174831769939,1053,775.16490912629945,1502.7596916492439,1088,825,1478,35,-503,560," "]
["North West","Rochdale",1413.2477380526591,1140.3874663242493,1675.1690267226852,1204.5123365924278,938.45758529282932,1486.9554691019455,1373,1062,1879,168,-262,716," "]
["North West","Salford",794.797904050076,514.92079564470578,1064.9024903323589,765,607.0777171629436,1029.2629478565086,1109,772,1702,344,-108,920," "]
["North West","Sefton",1524.3607107664295,1204.4249448401499,1840.3995410402697,1594.4150763549044,1269.2719768935926,1917.2455646490209,1427,1224,1759,-167,-561,294," "]
["North West","St. Helens",580,504.79630602633341,702.0175614493653,600,496.00026466182959,772.96875258171133,704,414,1002,104,-246,411," "]
["North West","Stockport",751,595.40266805778867,971.39207493846368,666.01686708197826,325.07482365415939,997.80877596999494,844,412,1320,178,-373,712," "]
["North West","Tameside",908,735.46726778179982,1205.9566466578774,797,637.21132085943475,1053.7007488494594,812,680,1009,15,-289,266," "]
["North West","Trafford",441,338.77667592038193,590.66318324850863,495.19905367207502,236.21852407015132,759.08276489737921,559,181,975,64,-374,573," "]
["North West","Warrington",563,460.62048428861505,727.46036346325195,587,410.25335484521997,930.1242887901094,869,599,1367,282,-166,838," "]
["North West","Wigan",510.45624967458201,237,886.4558637091618,592.80290446182835,261,958.95377125106495,813,280,1332,220,-438,842," "]
["North West","Wirral",1568,1304.6039408098584,1921.3848319803767,1261,1051.1608982495561,1586.7355996111844,1188,1017,1474,-73,-445,268," "]
["South East","Bracknell Forest",258,192.61724110539677,396.99550916275518,204,148.28299040935121,351.99727811568528,291,187,542,87,-102,340," "]
["South East","Brighton and Hove",901.7006029730245,558.43532977973814,1230.758495738791,864.50846573327033,513.73906951070478,1210.0599050451133,1210,921,1680,345,-106,911," "]
["South East","Buckinghamshire",966.51863382136969,425,1577.1323692707776,862,706.47645229912121,1117.1039786655613,1362,956,2044,500,30,1201,"*↑"]
["South East","East Sussex",1209.5647204822201,671.28636777793474,1819.2273619029602,1121,928.56438228682259,1398.8366802984099,1232,992,1564,111,-262,493," "]
["South East","Hampshire",1385,1230.2530549325393,1583.6628005014725,1743.027007700641,616,3229.0331448403163,1775,1430,2155,32,-1515,1550," "]
["South East","Isle of Wight",139.70586754491586,41,295.84813389553511,149.96791798149633,46,290.33859273755689,238,51,459,88,-165,354," "]
["South East","Kent",2862,2465.4811187463142,3379.0035877947821,2422.1016238054854,967,4041.3402566364753,3398,2780,4206,976,-703,2849," "]
["South East","Medway",772.36039066885598,460.10691448063204,1074.6973609438057,848,642.03528004254918,1152.7129856067179,848,368,1360,0,-566,579," "]
["South East","Milton Keynes",413,345.7759240676142,517.63407758670064,495.95922697462407,214,804.35032918755508,774,319,1204,278,-253,764," "]
["South East","Oxfordshire",2307.6529876879681,1481.9415853719242,3081.6173176256034,2484.8420243983405,1715.9363970748079,3256.4958319405723,2416,1146,3521,-69,-1613,1339," "]
["South East","Portsmouth",620,517.7951486167608,780.7738917428868,639,531.66146301699018,778.05177233901588,845,456,1233,206,-197,594," "]
["South East","Reading",738.70791703632585,530.35073936508752,948.30286357425109,757.98328876744347,543.39770256668101,953.34460851324184,881,595,1171,123,-220,489," "]
["South East","Slough",584,525.80831026848045,670.67296452687845,704.44021451214348,542.32026256690722,882.66852978943155,689,437,940,-15,-316,271," "]
["South East","Southampton",949.83919011889941,628.16807684554453,1260.1081628992599,829,713.52875453940806,994.69761416921779,1115,666,1559,286,-185,738," "]
["South East","Surrey",2069.021159627061,772,3384.9312664598478,1996.2119851325372,746,3215.4661985318012,2243,1737,2741,247,-1151,1611," "]
["South East","West Berkshire",199,157.40652015273886,280.64696512745468,292.5948947911146,123,478.98919755908673,337,245,510,44,-167,298," "]
["South East","West Sussex",1638.3045371784858,717.98594216435458,2547.4528926648918,1421.6140846560875,578,2304.9879700496072,1927,573,3259,505,-1193,2111," "]
["South East","Windsor and Maidenhead",366,282.00416474343501,521.52493914002309,323.38630414676106,143.93025913288838,482.27629129318092,383,251,647,60,-161,366," "]
["South East","Wokingham",202.14858652134478,62,395.22582231644122,200,101.80715554278709,548.05203053662331,162,102,337,-38,-392,174," "]
["South West","Bath and North East Somerset",565.68723507962068,343.09964462956441,777.94212351850797,691,445.04670117693394,1288.3466366695952,449,322,750,-242,-828,146," "]
["South West","Bournemouth",1316,1117.7470640025933,1578.125695196851,1098,916.19111765855371,1395.2062565988826,1114,889,1500,16,-339,410," "]
["South West","Bristol, City of",4327.1614761080627,3649.7745549427173,4950.7728738418627,4303.6735668673764,3597.9169886945488,4944.3166742414251,3710,2824,4584,-594,-1691,535," "]
["South West","Cornwall (UA) and \nIsles of Scilly (UA)",682.30247060843215,174,1298.9502137514717,542.43085952921228,155,1140.0202246702997,783,71,1604,241,-850,1210," "]
["South West","Devon",987,614.10304492407784,1670.3855714167728,809,485.5539496463137,1500.9361073952159,996,518,1229,187,-803,530," "]
["South West","Dorset",564,342.46640851957284,1073.2207060039354,516.77638842249098,192,957.77835720208009,823,205,1487,306,-452,1088," "]
["South West","Gloucestershire",1573.0100751581017,933.35476975605775,2284.1213121642845,1424.8124621858524,728.26476183305977,2113.4394563275255,1938,900,2880,513,-698,1695," "]
["South West","North Somerset",746,578.62597232813607,1058.896780676369,521,421.01869349366308,713.87380583293088,657,322,977,136,-255,469," "]
["South West","Plymouth",552.3690028372481,237.74542288124104,887.55725187328653,526.1275613892825,219,852.22833566658301,686,435,1198,160,-244,745," "]
["South West","Poole",235.62369146672168,86,398.26517219872892,240,136.45092549487725,564.80842721302793,446,225,1033,206,-199,785," "]
["South West","Somerset",774.08828645894562,285,1369.8024124087867,774.66764308463144,285,1364.9162252199537,718,534,1099,-57,-714,639," "]
["South West","South Gloucestershire",702.44908677395574,375.84107088888709,1016.4257936738287,691.89841366825067,391.39875650300201,997.8241253359372,931,548,1173,239,-315,567," "]
["South West","Swindon",552,461.33661541675343,697.22456207446794,607,466.71234211860946,845.73539479437875,919,503,1335,312,-138,745," "]
["South West","Torbay",172.47272426240301,69,317.85187946024973,148.9019129742029,53,291.70255068921614,232,46,437,83,-159,332," "]
["South West","Wiltshire",636,481.07810958886546,892.90325262924284,653.18986976732276,224,1160.6172119061046,978,251,1764,325,-685,1273," "]
["West Midlands","Birmingham",6926.4120063392475,5648.3632572511115,8282.5525148565994,7264.0944911584274,5833.260840691868,8535.3189518984145,6689,4692,8743,-575,-2917,1972," "]
["West Midlands","Coventry",1579.927835129484,1162.3254332322026,1949.1908488563781,1340.6088276590713,937.93815890074063,1699.5434628458211,1234,1064,1490,-107,-494,316," "]
["West Midlands","Dudley",1174,1023.7429473610155,1389.7909456300224,1102,918.09587042455587,1387.2504261253719,1049,896,1244,-53,-373,205," "]
["West Midlands","Herefordshire, County of",304.89014321025621,123.71362410766291,506.04275711205651,265.88601773405009,104,466.59744544839401,393,113,706,127,-237,540," "]
["West Midlands","Sandwell",1380.3204400110014,1027.9634381735202,1729.3023686676645,1362.7439832402947,1003.4092088147169,1723.0387144608112,1766,1469,2177,403,-79,951," "]
["West Midlands","Shropshire",545.00753777644081,233,900.08852767767758,390,313.15065040086711,534.24803636471336,556,452,722,166,-10,355," "]
["West Midlands","Solihull",432,356.07214486742504,543.25805006492374,456,374.70426546996953,601.0721349052302,377,315,463,-79,-231,41," "]
["West Midlands","Staffordshire",1588.6525669589323,651,2600.5529031296478,1627.6535758896973,675,2578.2826230211003,1991,568,3325,363,-1478,2098," "]
["West Midlands","Stoke-on-Trent",1123,908.95997635026526,1422.2546620336798,1049,891.55622110960451,1293.9493515106954,1434,1100,1990,385,-12,936," "]
["West Midlands","Telford and Wrekin",442,363.44453835166445,562.63743775815931,379,298.82376579753759,540.2712020971652,644,361,931,265,-46,578," "]
["West Midlands","Walsall",1238.3873140067512,924.98388372720251,1559.9298335384769,1307.7646253351732,975.70953786498501,1606.2276339028153,1376,1186,1630,68,-293,508," "]
["West Midlands","Warwickshire",1058.308012086145,466.86976733526961,1663.9059169357679,750,612.70500082372553,973.80568113327388,1291,1024,1571,541,172,859,"*↑"]
["West Midlands","Wolverhampton",1655.4061510040144,1339.2838277624937,1949.1648730850261,1346,1212.5311588809241,1502.0526783179298,1679,1264,2132,333,-113,781," "]
["West Midlands","Worcestershire",1306.1421906932187,675.21577760686523,1983.0668064749955,1250.3071961033265,651.33044586822541,1923.7595928103588,1451,452,2383,201,-1005,1315," "]
["Yorkshire and the Humber","Barnsley",648,518.06926395494452,854.44963631959774,848,665.90129384453098,1155.6286214630854,782,528,1225,-66,-461,402," "]
["Yorkshire and the Humber","Bradford",3700.0259532856317,3040.3787786768867,4337.1169670012887,3637.4372266079704,2964.3746449171936,4265.8721465196004,3308,2354,4213,-329,-1522,835," "]
["Yorkshire and the Humber","Calderdale",626,566.94425389790194,712.22332126628635,682,601.04743000052258,800.15706231158492,946,608,1292,264,-92,634," "]
["Yorkshire and the Humber","Doncaster",955,786.14787739539645,1231.0291461523236,1106,865.38263316733344,1554.104515583294,842,337,1353,-264,-916,310," "]
["Yorkshire and the Humber","East Riding of Yorkshire",468,271.53350509931971,938.72235456124986,422.2537935195129,143,822.77078565671161,545,88,1101,123,-542,788," "]
["Yorkshire and the Humber","Kingston upon Hull, City of",1206,970.47464614388286,1561.823831415926,1062,832.68687479429855,1421.7186432612268,902,591,1429,-160,-602,430," "]
["Yorkshire and the Humber","Kirklees",1621.5965869186175,1124.1136134738945,2085.1885405329808,1166,1032.8930751624628,1363.1816837050101,1776,1016,2555,610,-184,1352," "]
["Yorkshire and the Humber","Leeds",3307.6619358392941,2252.3668655743736,4335.3157236433863,3398.7044224789961,2460.3926259135524,4299.045921312485,3274,1907,4623,-125,-1794,1586," "]
["Yorkshire and the Humber","North East Lincolnshire",546,419.54629424617218,753.32316065743919,560,443.84522883998847,792.64069451500177,693,472,1125,133,-188,548," "]
["Yorkshire and the Humber","North Lincolnshire",412,352.16203013595106,523.12681762314912,431,375.34694547419849,524.3484076353318,579,481,728,148,1,300,"*↑"]
["Yorkshire and the Humber","North Yorkshire",406,312.67042145493906,586.8231804143885,808.4747480405282,290,1526.6904837940021,1099,254,2042,291,-934,1486," "]
["Yorkshire and the Humber","Rotherham",637.47680158865091,325.83663971886239,951.55278705030241,714,495.05477539883231,1172.523506152643,830,597,1246,116,-382,556," "]
["Yorkshire and the Humber","Sheffield",2966.8272498045726,2256.1630209922969,3681.2680580068454,2588.4559191822214,1914.256852311883,3289.1218203395415,2546,2018,3207,-42,-947,868," "]
["Yorkshire and the Humber","Wakefield",894,765.05709096563805,1066.0354431978599,1177.7245517786234,802.95664322666937,1557.2833304204173,984,457,1547,-194,-865,472," "]
["Yorkshire and the Humber","York",398,251.42041198047505,719.80881525808627,404,241.19666350195817,799.05624157836371,305,178,576,-99,-548,218," "]
["East of England","East of England",13092.805411032841,10946.868667573066,15304.122598042935,13163.21893041578,10706.680003691295,15636.127585301954,17408,14005,20606,4245,-101,8262," "]
["East Midlands","East Midlands",12109.756012916088,10444.034268577008,13854.957550180465,11687.080364527697,10119.05671699081,13531.560860695101,12331,10451,14255,644,-1897,3198," "]
["London","London",39934.101369843374,38375.458981302218,41756.83286259434,40080.060703714931,38300.300003302073,41996.584653268896,39226,37364,41940,-854,-3469,2499," "]
["North East","North East",5567.2090912800213,4630.173258062654,6649.3061945678955,5543.5528469413293,4600.4314618010558,6563.4495997979329,6331,4965,8002,787,-897,2834]
["North West","North West",27407.395568404198,25432.472568864523,29496.40518008095,25361.359622843953,23219.030487719669,27577.673251057891,28685,25980,31979,3324,-34,7428," "]
["South East","South East",18582.52459366047,16444.298670196495,20758.562509552274,18359.637038599943,15585.250956825515,21356.562385065041,22126,20015,24583,3766,77,7399,"*↑"]
["South West","South West",14386.164048753491,12886.22435881556,16092.32919676711,13548.478677888621,12144.68513960712,15342.464261889752,15380,13116,17255,1832,-1261,4033," "]
["West Midlands","West Midlands",20754.454197215491,18822.145943765587,22745.196880660173,19891.058717120042,17795.314368618663,22011.959892414834,21930,19184,24835,2039,-1482,5471," "]
["Yorkshire and the Humber","Yorkshire and the Humber",18792.588527436768,17317.912482704956,20540.562216603335,19006.050661607856,17487.839502312658,20828.436473394406,19411,17130,21989,405,-2597,3564," "]
["ENGLAND","ENGLAND",170626.99882054277,165876.87250324362,176691.79240016965,166640.49756366014,161621.10189497174,173705.74117232897,182828,176675,190782,16188,6635,25832,"*↑"]

{"sheet":"OCU by Age","index":9,"n_rows":169,"n_cols":41,"rows_kept":169,"cut":false,"hidden":false,"merged":[[7,40,9,40],[7,29,9,29],[7,30,9,30],[7,31,9,31],[7,32,9,32],[7,33,9,33],[7,34,9,34],[7,35,9,35],[7,36,9,36],[7,37,9,37],[7,38,9,38],[7,39,9,39],[6,31,6,33],[7,11,9,11],[7,12,9,12],[7,13,9,13],[7,14,9,14],[7,15,9,15],[7,28,9,28],[7,17,9,17],[7,18,9,18],[7,19,9,19],[7,20,9,20],[7,21,9,21],[7,22,9,22],[7,23,9,23],[7,24,9,24],[7,25,9,25],[7,10,9,10],[6,18,6,20],[6,21,6,23],[6,24,6,27],[6,28,6,30],[7,26,9,26],[7,27,9,27],[7,5,9,5],[7,6,9,6],[7,7,9,7],[7,8,9,8],[7,9,9,9],[6,34,6,36],[5,0,9,0],[5,1,9,1],[5,2,5,14],[5,15,5,27],[5,28,5,40],[6,2,6,4],[6,5,6,7],[6,8,6,10],[6,11,6,14],[6,15,6,17],[7,16,9,16],[6,37,6,40],[7,2,9,2],[7,3,9,3],[7,4,9,4]]}
["National and local estimated number of OCU users by age band with 95% confidence intervals (CI) - 2010 - 2015"]
[]
[]
[]
[]
["Region","Local authority","15-24",null,null,null,null,null,null,null,null,null,null,null,null,"25-34",null,null,null,null,null,null,null,null,null,null,null,null,"35-64"]
[null,null,"2010/11",null,null,"2011/12",null,null,"2014/15",null,null,"Difference between 2014/15 and 2011/12 ",null,null,null,"2010/11",null,null,"2011/12",null,null,"2014/15",null,null,"Difference between 2014/15 and 2011/12 ",null,null,null,"2010/11",null,null,"2011/12",null,null,"2014/15",null,null,"Difference between 2014/15 and 2011/12 "]
[null,null,"OCU","Lower bound  95% CI","Upper bound  95% CI","OCU","Lower bound  95% CI","Upper bound  95% CI","OCU","Lower bound  95% CI","Upper bound  95% CI","Difference","Lower bound  95% CI","Upper bound  95% CI","Significance","OCU","Lower bound  95% CI","Upper bound  95% CI","OCU","Lower bound  95% CI","Upper bound  95% CI","OCU","Lower bound  95% CI","Upper bound  95% CI","Difference","Lower bound  95% CI","Upper bound  95% CI","Significance","OCU","Lower bound  95% CI","Upper bound  95% CI","OCU","Lower bound  95% CI","Upper bound  95% CI","OCU","Lower bound  95% CI","Upper bound  95% CI","Difference","Lower bound  95% CI","Upper bound  95% CI","Significance"]
[]
[]
["East Midlands","Derby",450.91560775978331,376.36819281512152,595.02444614577337,315.00478298102155,272.52986938045404,382.85856401874446,294,189,491,-21.004782981021549,-150,177,null,1083.9519660035783,930.8042984670883,1313.3556926668084,1007.5499497969445,873.38387018429546,1168.1194195459698,941,799,1183,-66.549949796944475,-284,206,null,993.13242623663882,850.71853428860675,1197.7396753635951,1051.4452672220343,919.01022224743872,1228.5348964915318,1082,910,1378,30.554732777965683,-206,322]
["East Midlands","Derbyshire",435.08854555736025,307.12851118110427,576.89406846098439,382.94801519069711,281.53678086352534,500.7865358411467,300,179,529,-82.948015190697106,-250,145,null,1691.0971121897962,1193.6009895316743,2170.3419097876508,1900.1631054769316,1402.5298771144205,2430.1608043954234,1307,847,1973,-593.16310547693161,-1284,151,null,1481.0400110314799,1040.7292059283491,1933.0333949045732,1432.2706124778617,1057.014949879172,1820.8888245742442,2436,1549,3245,1003.7293875221383,-14,1846]
["East Midlands","Leicester",371.52383765233083,291.03012792694415,503.22420491463021,326.12764035064009,235.0605377606407,477.86447984804005,345,102,563,18.872359649359908,-267,248,null,1051.2168950456557,849.75635489067122,1274.7485425825428,1293.5422606095569,1008.5156831970614,1577.8109805827605,921,655,1268,-372.54226060955693,-781,54,null,1281.2592673020135,1066.8569378506188,1612.2817328727681,1239.3648739088005,959.46708047469292,1542.8282652729272,1532,1207,1830,292.63512609119948,-170,690]
["East Midlands","Leicestershire",306.75186545482785,279.44637534952534,345.67961725430564,225.69409323843925,196.61200760204872,305.2926170173871,407,97,687,181.30590676156075,-158,449,null,955.97954217347126,875.69961628505325,1039.7706727999964,901.40484604695473,793.15215559181115,999.49377698592787,928,485,1787,26.595153953045269,-440,884,null,826.26859237170083,763.02336223930013,912.10070775325926,723.90106071460582,638.83834689968455,818.50004448431662,1365,856,1897,641.09893928539418,145,1201,"*↑"]
["East Midlands","Lincolnshire",348.25400438583085,247.02465460523766,462.00366173868377,539.68934763994844,359.77673128542324,820.42797641639004,206,138,340,-333.68934763994844,-619,-106,"*↓",1389.2756473111051,976.37999636066695,1812.372692950496,1258.8677194248819,873.16603231799525,1620.8918200699816,1179,853,1658,-79.867719424881898,-568,559,null,1301.6541584632314,911.42702028615565,1699.3165158177544,1268.4090739454496,873.09188694713191,1630.4391584359116,1715,1252,2202,446.59092605455044,-172,1105]
["East Midlands","Northamptonshire",400.44706410831469,348.63253313558261,520.10174813135484,335.92019346017094,245.29607948157383,488.15144006914625,360,115,589,24.079806539829065,-288,256,null,1204.7407778052559,1104.6646467100779,1324.3547654872766,1041.2284022001909,741.84220469939544,1329.8137937940512,1159,785,1556,117.77159779980911,-352,603,null,1323.8121580864297,1210.6318715592549,1447.8324552055947,1746.5451401135756,1254.5680822221443,2219.4745496032497,1896,1313,2475,149.4548598864244,-637,879]
["East Midlands","Nottingham",602.58110387508839,311.55529812099502,1210.7250392789772,509.48275317258253,225.46553948086765,1222.7879845652335,324,89,665,-185.48275317258253,-1021,272,null,997.95843877217862,794,1290.2872375694119,887.69391548626254,556.4796120863241,1116.0505453627172,630,450,922,-257.69391548626254,-537,207,null,1105.6213383185243,934,1437.2934113704516,1217.3414236338378,750.99082368646737,1501.8053186177397,1746,1489,2204,528.65857636616215,149,1189,"*↑"]
["East Midlands","Nottinghamshire",622.99155274687803,468.57633142421281,827.82119073613705,444.6304164390167,350.11181509183416,565.6329106966316,941,316,2421,496.3695835609833,-127,1967,null,2192.0013479700428,1675.9744733043303,2721.4601990602218,2194.4956264239804,1707.1736664668183,2659.7577623495476,1123,617,1658,-1071.4956264239804,-1759,-365,"*↓",1731.6405941987168,1318.4262610293215,2143.6730776895633,1796.8413635854565,1416.9908661504417,2176.5470792802998,1853,852,2471,56.15863641454348,-1011,810]
["East Midlands","Rutland",6.5319494408295062,2,13.451344862680134,7.0042448767785466,0.17670959185590568,14.23753936583303,15,1,28,7.9957551232214534,-9,23,null,26.083897579760773,9,46.519373258107521,10.290352174965234,0.25961455781759551,20.917214781897087,23,3,53,12.709647825034766,-9,43,null,26.083868116505293,9,46.519341193025163,27.520581167800263,0.69431476968058958,55.941127823256387,29,4,56,1.4794188321997375,-33,40]
["East of England","Bedfordshire\n(Bedford UA / Central Bedfordshire UA)",268.32925389525963,213.3740711352815,352.07755636535353,251.87948852899333,205.06157362651606,336.45816770867418,120,63,258,-131.87948852899333,-231,11,null,742.87664033672547,591.66566794541995,928.04799998228054,761.45636589240564,651.96412922450872,888.76073121542515,761,538,984,-0.45636589240564263,-250,264,null,1053.7941057680148,879.31005516853327,1316.0752506540282,696.66414557860105,595.88786479410237,818.01309013820924,1314,906,1704,617.33585442139895,193,1015,"*↑"]
["East of England","Cambridgeshire",312.47481322988045,266.43602047204899,394.98331265255547,198.10711013271919,164.66719133413565,319.26572977487876,353,162,840,154.89288986728081,-85,614,null,904.71254422380287,819.99940471039122,1026.0833454992362,622.29091049570877,538.0228889504175,723.823169681134,634,441,812,11.709089504291228,-206,229,null,954.81264254631685,862.8870610487138,1078.1870791703054,958.60197937157193,842.56416245266666,1110.5379915944516,1240,873,1512,281.39802062842807,-80,569]
["East of England","Essex",703.13141417362647,390.27059445780856,1086.2244527559922,516.87092691480234,309.66473152193009,811.97055418450441,785,268,1224,268.12907308519766,-355,758,null,1668.8038687603278,955.58888317204401,2372.8221893055465,1369.353331776588,819.77320362410296,2021.6806831646677,1686,1044,2378,316.64666822341201,-615,1166,null,2184.2382866505641,1272.572964797665,3118.7058363314914,2443.2593256288847,1480.0563079753438,3407.1480827882847,2992,1881,4100,548.74067437111535,-994,2036]
["East of England","Hertfordshire",824.05866222312852,442.73323335722841,1394.4314806074906,306.81510806326003,239.96202281787623,423.6380027776774,702,190,1192,395.18489193673997,-151,896,null,1257.7006527372557,837,1770.8121227299534,1129.7280834802552,884.08115141674637,1467.1890266803443,1138,526,2306,8.2719165197447637,-710,1229,null,1671.1977076664045,1019,2350.0744636035661,1918.4568084564849,1613.2957532414953,2402.076106280992,2386,1410,3455,467.54319154351515,-656,1469]
["East of England","Luton",340.0554906385355,279.80565913970105,446.64277303615592,243.90092685586652,190.57650185196889,372.88041677486262,196,70,375,-47.900926855866516,-230,115,null,691.09095002482161,599.13300659472839,808.71238320303439,645.9806318851123,542.09871508822039,794.54595226073741,632,468,819,-13.980631885112302,-231,199,null,761.85355933664323,661.93902227215483,889.12265921003814,714.11844125902132,601.76963878143624,892.55255028037448,887,680,1113,172.88155874097868,-101,428]
["East of England","Norfolk",438.01566240264799,312.46675136202771,570.86138788079711,327.73824062836491,242.49649224732119,427.56865117540076,232,177,328,-95.738240628364906,-210,26,null,1514.5739981723166,1082.307438312276,1927.5205816074892,1361.2588976268073,981.98105072899136,1722.5266595333621,1181,998,1404,-180.25889762680731,-587,235,null,2248.6599376617078,1606.3011161963668,2929.537231982642,2237.045229254818,1647.5469469362042,2819.9672445641017,2568,2281,2923,330.95477074518203,-300,1060]
["East of England","Peterborough",226.71506844735836,196.02294067928437,278.43751371152513,165.33068411911034,123.03336817254768,448.51731918319814,104,59,203,-61.330684119110344,-338,41,null,633.10870374596345,565.43059814998162,718.61464774275282,473.59690493736673,355.70871828513066,539.3340865582627,802,608,1049,328.40309506263327,132,598,"*↑",585.17622780667818,526.99750745644485,657.197833143298,652.07241094352298,473.86260688092375,736.3696675484689,631,453,803,-21.072410943522982,-220,231]
["East of England","Southend-on-Sea",199.70573571188629,159.33707121487612,313.50108169158506,140.95843539710404,114.85683838416435,199.96419960282702,93,28,208,-47.95843539710404,-148,71,null,373.50039056332128,308.61272641748121,513.82750976446687,341.92885883270611,279.7239825099922,426.23543821989421,262,208,340,-79.928858832706112,-181,17,null,618.79387372479232,513.74937532003548,848.99113813561257,569.11270577018979,476.21857641810834,706.64247024532835,678,571,829,108.88729422981021,-56,280]
["East of England","Suffolk",385.11497598444578,347.26445883225813,437.79613677737098,254.82525402026269,220.45643535548325,315.16569504893778,212,106,394,-42.82525402026269,-170,141,null,722.17476026300483,655.52245271309744,806.04594553358743,908.7194966943598,804.54309866615677,1114.5485516583051,833,439,1431,-75.719496694359805,-508,511,null,1167.7102637525491,1071.5574045252547,1292.1271375328774,1234.455249285377,1081.6865422761857,1462.2397568342333,1806,1088,2571,571.54475071462298,-168,1331]
["East of England","Thurrock",97.796284607157006,76.856390509694151,148.12107265947864,139.33366653663771,79.734814492191688,370.8366969244002,163,37,560,23.666333463362292,-264,391,null,91.597217288521506,88,126.50529619634966,160.40533086681029,61.94481504174626,239.91387890206622,139,40,264,-21.405330866810289,-143,135,null,209.6064981043215,162.63349321627607,286.36998054901534,207.45462329222801,73.750150986358392,275.37925270919038,380,111,628,172.54537670777199,-70,465]
["London","Barking and Dagenham",224.02826058871588,156.30413345838707,369.70550101676298,214.27783549249313,162.76186076481719,344.00999047490535,114,75,224,-100.27783549249313,-226,9,null,419.08971260446395,297.76728596865041,540.96271847251955,445.44779552555059,350.76719023672649,557.87224056018124,446,347,585,0.55220447444941101,-151,164,null,350.48366227918802,286,457.28223195986271,419.27436898195634,336.4492058862316,514.46242374640974,590,465,739,170.72563101804366,19,337,"*↑"]
["London","Barnet",165.67581518132891,131.41541046085746,239.46066313334353,254.32438237128511,193.75077221087417,386.1827352618007,334,123,971,79.675617628714889,-165,700,null,373.11867982812231,306.74277742386079,471.75235026856149,318.87840132650524,251.80959203564535,407.84155740194575,352,207,586,33.121598673494759,-136,291,null,917.20550499054866,780.38250870013235,1124.6571791148144,918.79721630220968,764.87003967730129,1130.6855169370622,982,611,1556,63.202783697790323,-381,659]
["London","Bexley",128.03847421255801,100.94304349116462,204.6196981514349,85.392896776610399,68.039608541357524,204.74062921840107,123,31,347,37.607103223389601,-122,234,null,186.00958386617572,144.76040671926609,256.49014396910786,189.82845011582754,127.91430493610144,249.37475764572622,187,120,403,-2.8284501158275361,-83,223,null,400.95194192126627,315.78673346487909,522.01355277894095,329.77865310756204,235.10176356810146,431.99507430233308,414,286,900,84.221346892437964,-60,593]
["London","Brent",273.97713280498721,214.21456838591391,349.09593344118525,292.88623825508,218.1336599155571,398.7901287163142,235,136,431,-57.886238255080002,-203,131,null,610.3573895475721,484.17714677721204,736.43113859376422,539.81860659435188,395.77120822795905,670.31155175711251,578,391,834,38.181393405648123,-197,325,null,973.37171907185063,768.75650277767727,1190.7283769845228,1001.1025554185078,750.65043785507203,1228.0168099511186,1077,758,1468,75.897444581492209,-314,570]
["London","Bromley",169.11258866268224,99.819106861972998,334.48276402085384,185.8889556623669,134.65793955863271,351.18201204423048,248,101,610,62.111044337633103,-153,403,null,262.6063216390649,195,373.7076359110215,224.47444839827114,171.38025084990366,289.48426363312393,274,151,481,49.525551601728864,-86,251,null,580.74684499858745,348,809.06421076333811,706.63659593936188,551.49463130864126,886.29864801691065,699,427,1011,-7.6365959393618823,-313,346]
["London","Camden",234.24614418728268,131.88483362124205,509.97104673897411,131.52569488590544,108.31045123896993,179.71944509157527,317,153,657,185.47430511409456,12,519,"*↑",760.42599684850347,548.40782603000753,1035.2154447570761,471.32567496760856,388.00666931926577,553.25067453481518,510,349,725,38.674325032391437,-150,260,null,1349.8355855952732,1089,1624.9257242435854,1608.8020474447474,1386.8677475135178,1836.5289885287693,1270,928,1563,-338.80204744474736,-756,53]
["London","City of London",3.1675290728112713,null,null,1.514467180162959,1.0175744524618822,2.0675277204967064,4,2,7,2.485532819837041,1,6,"*↑",19.005174436867627,null,null,9.5078023168218877,6.3883171966176731,12.979908113237164,12,5,18,2.4921976831781123,-6,9,null,23.756468046084535,null,null,18.995952503727835,12.763430103025252,25.932987490775623,12,6,19,-6.9959525037278354,-16,3]
["London","Croydon",348.121414305526,227.69225410804768,523.87423912559586,197.77201152902418,128.02742053246664,311.78494462135029,154,99,282,-43.772011529024184,-160,97,null,593.40517930486624,406.76069973648924,776.46661979875591,453.57587667417249,295.06853394766239,642.37546060003922,577,417,848,123.42412332582751,-118,426,null,734.26599852613867,550,943.93885638825896,1262.5303654800948,926.54903538374094,1620.9211876794541,1297,976,1630,34.469634519905185,-401,512]
["London","Ealing",418.3565524485644,313.45913050172345,557.11368868357806,468.24075888806675,378.95823744563199,652.57111972041446,203,126,376,-265.24075888806675,-454,-90,"*↓",898.94996850447319,702.68690585573313,1107.5577584355335,911.3657568254398,785.72686522812523,1067.546791763793,949,681,1267,37.634243174560197,-263,382,null,1068.091704114817,836.03559634497083,1304.6073524459296,1203.3934842864933,1047.1070943139339,1411.6326752794478,1312,954,1671,108.60651571350672,-312,503]
["London","Enfield",298.75066745161604,198.99949617090599,453.86712455512583,274.33888541273757,189.26456504220826,413.60769345555497,308,170,580,33.661114587262432,-168,318,null,521.83212820702306,346.59002452756221,677.76442168234564,591.2259171427462,402.57085531712454,771.93068610636305,406,295,580,-185.2259171427462,-405,64,null,677.31523772781043,472.62829018048808,865.36775010773169,679.5625270941473,465.41677344246233,868.54500431649569,1075,837,1424,395.4374729058527,98,810,"*↑"]
["London","Greenwich",267.91962799216924,217.09247172616554,357.10372942658489,313.68108787957436,246.10104725701581,427.81476533049602,145,53,251,-168.68108787957436,-327,-40,"*↓",507.54534163799849,419.53443197818171,601.00581683355676,552.48256006011161,426.67817567241292,686.76558308741062,552,336,861,-0.48256006011160935,-253,331,null,970.53503036983204,831.04351977469298,1123.6721945925249,1021.6487505212465,814.60878917871958,1246.1930949940058,750,480,993,-271.64875052124648,-619,56]
["London","Hackney",334.39812313636776,261.35485451150998,457.36054012670394,475.61985429191509,392.05717533228409,602.44831468037023,197,89,321,-278.61985429191509,-452,-136,"*↓",844.87455315604484,655.59736193539447,1066.7395314314006,795.75159443326413,664.66562317514661,933.15020287687264,906,654,1244,110.24840556673587,-182,481,null,1066.9868550573526,901,1267.1295269969264,1345.2341683685972,1131.7642148441923,1547.5037804855926,1450,1126,1751,104.76583163140276,-266,488]
["London","Hammersmith and Fulham",203.78161818392275,141.36071632620087,321.24352446840862,69.384420338725491,49.099225264807714,117.29630001250327,177,74,461,107.61557966127451,-17,395,null,303.08771454824159,272,383.5525830643673,507.08177903974723,345.68966059512627,751.6608802677473,317,192,480,-190.08177903974723,-471,39,null,1041.3599812478897,841.5987369036435,1233.7722168125304,813.54666675243493,574.45510782500662,1037.4369145301287,1006,711,1260,192.45333324756507,-168,539]
["London","Haringey",395.92761229592315,312.62064589001608,527.81663359316337,273.19765301495016,199.72166575657857,371.58065232016594,136,51,272,-137.19765301495016,-277,18,null,546.37557654632508,431.50649852025197,668.82834279554322,798.11615844870266,625.38630641992847,1029.9221108434924,494,345,703,-304.11615844870266,-576,-45,"*↓",923.90393287624033,738,1098.1920031875557,775.58325389938807,586.49614649753516,942.55016832910587,1226,889,1569,450.41674610061193,90,841,"*↑"]
["London","Harrow",172.97046012880759,109.32195908693845,302.27619570724687,123.45429303183242,75.197488502071366,285.08596693534645,153,48,329,29.545706968167579,-174,194,null,292.52625228005274,210,400.96884345550217,350.7778433642294,207.80632551062092,488.51255102266146,396,270,586,45.222156635770602,-144,296,null,389.46378334981381,240,539.61611042464278,424.07159328808888,249.0918815993879,591.86855510280259,644,479,871,219.92840671191112,-9,518]
["London","Havering",129.44924636359036,100.13414640135437,240.37357118283919,164.39638239938756,122.48592991128415,348.62992828887025,164,70,389,-0.39638239938756215,-215,220,null,309.61308691978815,233.63371922917415,397.1994433261043,224.74716029133245,163.4113437930254,395.43019043922845,199,127,309,-25.747160291332449,-209,92,null,431.93766671662144,333.57598811578845,531.52445096770714,462.8564573092799,340.8433578852613,768.08926505547379,531,357,733,68.143542690720096,-296,294]
["London","Hillingdon",193.76999636054674,140.85134142753458,273.74053078421224,114.11601837939101,75.018364874216672,165.01680206382446,244,149,460,129.88398162060901,23,351,"*↑",673.49389311671837,484.32655472923074,866.2724130702652,370.20263108197429,243.0432824220982,505.21240634349255,607,457,835,236.79736891802571,40,506,"*↑",495.03719864409732,346.01968011268946,635.45368381512617,741.31261430686141,507.15242776828904,992.8175389618666,1195,955,1582,453.68738569313859,95,887,"*↑"]
["London","Hounslow",249.64744019425186,190.36750717180234,320.50473715440137,152.24111734734097,128.79192791287085,197.78836763298173,204,108,388,51.758882652659025,-55,232,null,645.25727211890194,498.96459401657518,785.56984133896879,577.05739330454821,505.73294110115728,697.47755625278603,592,330,852,14.942606695451786,-273,275,null,663.0766576226265,515.97246777391081,805.60086781562313,550.70148934811084,480.48696829844079,655.00598144759181,740,484,1060,189.29851065188916,-83,500]
["London","Islington",363.6697907171469,251.3445807141544,620.06436675792554,329.55570827395957,232.74863812525186,589.69354631205567,219,105,470,-110.55570827395957,-403,136,null,718.80591812747491,517.21606914392908,963.89040700053681,683.83244134653273,524.0647161597625,924.18417358031411,486,331,678,-197.83244134653273,-474,33,null,1247.3541893088491,1093,1490.1243161643661,1609.6118503795076,1322.4386379761154,2007.5407953935542,1463,1144,1768,-146.61185037950759,-639,281]
["London","Kensington and Chelsea",71.683154393615794,55.963502106187185,110.26883890197929,53.927066659382312,42.16126461293517,64.950698515987597,71,23,215,17.072933340617688,-34,160,null,361.48797745553333,267.18869160406268,473.31349888135179,221.70016293301617,173.32964507410347,267.01954090905713,327,210,582,105.29983706698383,-18,369,null,1129.8288681508509,966.11864449631719,1342.8748409153882,789.43233693040213,617.19407287173965,950.80606620722654,852,660,1357,62.56766306959787,-166,595]
["London","Kingston upon Thames",71.899829799498463,57.17989737027176,154.37019165198774,65.760098805457773,53.56169833839499,157.65011063960219,80,29,295,14.239901194542227,-95,201,null,161.19607957622787,123,211.3724966207653,179.01210029860147,132.40842969265725,269.32150725619317,184,103,346,4.9878997013985327,-118,168,null,310.90409062427375,242.64906085252252,385.97881190520172,277.22780089594079,194.80938395691018,394.39526878046598,289,170,483,11.772199104059212,-151,224]
["London","Lambeth",214.04562091292377,172.48197411447785,271.85434014812296,295.20524120487579,211.5199080422835,444.10010013061276,176,77,364,-119.20524120487579,-301,77,null,849.71782620654676,685.53808746913523,1036.6072934962508,1020.5901859036012,716.18460489618815,1388.2632388975537,581,402,799,-439.5901859036012,-871,-80,"*↓",1607.9348834880736,1311.7240635350813,1897.968219966197,1758.2921207341178,1359.2105867158368,2120.7337178192215,1630,1223,2069,-128.29212073411782,-678,476]
["London","Lewisham",328.91357547236674,260.40712951121083,437.85291937815128,304.76950806679775,259.37589099552224,397.69057882065647,178,72,343,-126.76950806679775,-274,36,null,552.66942546713119,432.95890000513822,675.43488466807196,714.74990628918772,608.70367775142734,870.55806639452533,425,275,619,-289.74990628918772,-504,-82,"*↓",1202.9557198157108,967.09434807780724,1439.9727898873446,1418.4805856440144,1250.3576482964202,1673.5163239356079,1337,961,1720,-81.480585644014354,-536,318]
["London","Merton",98.568647864455031,82.78687555518097,156.59428424992964,95.003648136205683,74.690322211252266,151.24279360426175,78,19,162,-17.003648136205683,-115,60,null,290.08677386848512,232.875715173413,361.26737425458219,324.02701259646568,253.06429311785183,484.64477247095505,200,65,359,-124.02701259646568,-353,31,null,453.34457826705994,366.4657925312103,549.01680684884559,375.96933926732862,285.38651998701533,551.93577949308633,357,168,668,-18.969339267328621,-272,311]
["London","Newham",718.98223450030014,524.93976872352687,998.66471624125825,670.30305412122266,556.51079147841097,940.65534755937335,377,163,583,-293.30305412122266,-651,-67,"*↓",853.71174135321019,657.72298098152953,1011.0124643748367,1232.335758514291,1040.122214082674,1605.8129692030204,809,536,1074,-423.335758514291,-906,-98,"*↓",891.89834309124512,699.09270530770402,1047.4827992518044,1021.3611873644863,866.5381308728879,1322.3910665609287,1214,833,1773,192.63881263551366,-320,745]
["London","Redbridge",351.15250455008078,292.85014116964271,454.93906556943756,295.62231779036432,218.55890976148555,609.64842756713892,168,43,350,-127.62231779036432,-464,45,null,500.31445407903641,416.3227926762217,596.07951845085813,570.49197927462831,429.26745727533455,855.23247863126176,370,212,594,-200.49197927462831,-537,49,null,580.53304137088276,480.4645084758626,681.05377774786939,637.88570293500732,477.74536959351389,934.57414325898128,595,356,900,-42.885702935007316,-465,299]
["London","Richmond upon Thames",50.802901978168997,29.186283937530163,109.44385153063497,39.499053727566981,28.148484470149299,174.55378027458582,91,23,516,51.500946272433019,-97,439,null,200.97429605590764,105.45330828642696,353.52417040118502,209.19319074888426,137.9266600505623,305.41627956122102,219,80,401,9.8068092511157374,-152,208,null,379.18268669860009,224,533.74824741440727,400.30775552354874,273.52607100851782,556.30245911353177,512,221,789,111.69224447645126,-201,430]
["London","Southwark",577.28523955344929,391.4703710265664,863.05538244082254,414.17965424655273,241.58782032915411,785.32267513629222,164,68,323,-250.17965424655273,-632,-18,"*↓",496.77814468471382,386,598.09777853705657,588.74355402138588,447.32036154949793,725.78568967049728,478,219,736,-110.74355402138588,-401,194,null,1471.6426809484847,1151.0328861471226,1766.0029603129794,1825.8419639455981,1473.3513108079169,2175.7772520065537,1615,1155,2157,-210.84196394559808,-782,429]
["London","Sutton",126.55676203757201,82.598056257837442,198.01051614671749,153.03068830491131,107.27180741956749,322.73409267849115,133,48,406,-20.030688304911308,-217,247,null,326.59720466688856,217.25619907381511,511.94773195194176,242.3143201187282,166.93642201318465,354.01107294919495,267,146,435,24.685679881271795,-127,217,null,590.84603329553943,445.65426594170964,809.59283048362215,411.65499157636043,276.68337463952713,573.45170383048526,436,264,670,24.34500842363957,-206,290]
["London","Tower Hamlets",505.54605977289214,296.50983490285103,855.62626704364538,380.18472289213133,313.80748939833893,518.54823146955937,410,201,809,29.815277107868667,-230,429,null,1051.4062439402376,855,1261.1529438668438,1549.3239434180982,1313.1453215940289,1824.3682015467266,852,583,1086,-697.32394341809822,-1075,-368,"*↓",1469.6821282958965,1183.0511636299236,1753.5306084805079,1631.0611996220168,1376.9735686421284,1853.4930573597835,1536,1197,1863,-95.061199622016829,-493,319]
["London","Waltham Forest",344.38598598862791,267.04888294406766,447.32128609582105,444.02777734757586,301.04230509543027,675.48017871094839,170,102,292,-274.02777734757586,-510,-78,"*↓",428.26266782363541,334,534.07767715308148,457.04513100786562,337.74588580649134,579.51981020283336,487,319,682,29.954868992134379,-171,275,null,690.65261529653628,533.39452517496545,834.86292976150787,701.8414068008459,518.57726154178363,879.72929039183714,821,550,1114,119.1585931991541,-198,460]
["London","Wandsworth",250.96177750949562,186.51928283844845,359.87202387941051,184.93981655953866,124.11900366490501,324.99285978559385,142,61,221,-42.939816559538656,-211,57,null,461.5252157259705,334.59566508992992,584.66431480981475,536.527242574399,358.2310754171952,759.42358897732743,468,227,678,-68.527242574398997,-412,213,null,975.50546944292989,715.9838869814854,1200.9309688643621,912.08655584266239,634.64706621144308,1190.9407187772197,887,573,1375,-25.086555842662392,-442,560]
["London","Westminster",107.73165302721065,85.255918099164987,141.99296254808405,129.93740684298555,107.62484747736254,200.4989059449517,172,62,625,42.062593157014447,-95,476,null,843.90573294806961,644.23539435198063,1081.8359312258572,798.35443259143312,654.58681888248361,1031.5641329520922,487,335,684,-311.35443259143312,-581,-75,"*↓",1303.6549307475707,1030,1534.803048250129,1621.708160565581,1396.4294911189736,1904.2748027862467,1590,1231,1977,-31.708160565581011,-483,395]
["North East","County Durham",324.54190943744248,281.26995829011986,407.27358123580564,249.6563149051442,216.63436589913846,335.62591215510201,239,162,386,-10.6563149051442,-129,132,null,1267.1362678210687,1155.7809918188145,1414.8097884314652,1098.4249733349827,995.28698615043129,1202.4949765901479,942,711,1259,-156.42497333498272,-403,188,null,784.32182274148897,702.25798521178251,909.34356904506626,806.91871175987308,731.1194285489355,899.8628411912822,1130,811,1461,323.08128824012692,-12,657]
["North East","Darlington",113.71158678020591,95.541249066836301,241.84407760968955,78.247098390133004,65.560841069119959,114.21230935489265,49,30,141,-29.247098390133004,-74,71,null,352.79887773596477,292.61931653468872,584.52330124464197,339.63796384363292,295.912671434304,400.04846659978148,252,179,329,-87.637963843632917,-184,1,null,312.48953548382946,264.44698828591584,539.9823282075813,299.11493776623405,259.43659947085786,354.93212427766287,505,383,620,205.88506223376595,63,328,"*↑"]
["North East","Gateshead",252.24473574350051,224.02168529285342,300.36392553669697,265.70512473686233,231.35589012928938,332.44372049784766,103,65,480,-162.70512473686233,-240,205,null,806.31766545964399,724.27815477631725,909.97864482060163,857.19235232694712,766.5547720259035,965.80700753517112,797,615,999,-60.192352326947116,-270,161,null,506.43759879685524,460.21266926448573,581.02932361929425,626.10252293619067,560.6616270951306,721.65582766967452,862,648,1072,235.89747706380933,7,450,"*↑"]
["North East","Hartlepool",102.79674778792933,88.389152452644268,139.43059359867638,135.31459261112525,113.67034425508993,260.22341416601671,47,30,129,-88.314592611125249,-213,-34,"*↓",542.14523480102184,485.60997314734658,642.33091597136877,495.66364715054965,413.10304800918351,545.74502518621023,333,263,444,-162.66364715054965,-242,-21,"*↓",456.05801741104864,409.57457702887899,544.42910682063166,387.02176023832504,330.52986103341107,433.72681030917136,664,562,854,276.97823976167496,170,491,"*↑"]
["North East","Middlesbrough",311.36623121507029,270.5789907349187,399.94724355254118,194.44990674279055,167.89095132051659,251.08998484996025,128,93,200,-66.449906742790546,-134,9,null,1272.5657848077065,1113.5935768819797,1609.7661701925758,899.98182044735006,818.47459135500935,986.27148152490099,782,626,932,-117.98182044735006,-290,56,null,808.06798397722343,699.04346208792538,1014.4872466062042,800.56827280985954,731.3537864857808,888.34717194157884,1264,1085,1469,463.43172719014046,264,690,"*↑"]
["North East","Newcastle upon Tyne",320.06225316811447,231.15657312309821,457.94359973260157,238.65450282769149,199.79442451062761,334.54054454434248,255,83,487,16.345497172308512,-208,254,null,1183.260183018212,917.28969356505002,1481.2197978493718,906.91631270060111,776.42677081242607,1059.419788064979,729,488,1059,-177.91631270060111,-452,189,null,734.82129101135297,651,905.46181308485711,1075.4291844717075,941.2241862399585,1264.7389958402155,1067,818,1319,-8.4291844717074582,-341,276]
["North East","North Tyneside",206.18389355839705,155.51605447100152,314.49156053749027,153.33324700400871,125.44891760999262,325.1730062312231,72,41,169,-81.333247004008712,-254,-2,"*↓",479.17268222868631,389.07553309537911,593.14043823447241,436.84849215772635,332.88637087720247,551.60921990104271,407,284,588,-29.848492157726355,-200,190,null,447.64342421291656,359.17306311423692,576.91198970001005,384.81826083826491,303.28672880671661,509.17718977809227,629,476,882,244.18173916173509,62,508,"*↑"]
["North East","Northumberland",204.68118968010458,174.24471318840372,250.39279495472175,175.78302070836273,141.30764571331306,237.01602407814454,168,106,320,-7.7830207083627272,-96,142,null,531.61877568429622,464.29567334430186,626.21299617334125,665.27927236765504,548.39119262149438,878.50759904094878,441,349,639,-224.27927236765504,-440,18,null,565.70003463559908,497.02882011172267,681.11485701685308,482.93770692398232,385.87674419901612,621.84490613797186,647,533,933,164.06229307601768,-12,452]
["North East","Redcar and Cleveland",176.78408436627797,151.1019859063241,338.72247701138178,194.36344555367208,147.70333065077423,316.35948663385426,185,89,440,-9.3634455536720793,-172,215,null,471.16469928371038,377.92062850066071,541.62022446842195,450.32159577442667,362.87278984227652,528.09636245819422,440,276,720,-10.321595774426669,-187,295,null,407.05121635001166,331.04132099598274,478.56841577326105,409.31495867190131,334.04453307014279,491.3010951704378,572,395,947,162.68504132809869,-27,560]
["North East","South Tyneside",143.44687305163455,121.25013237139548,179.0159178516044,75.134149899226657,49.723945768341352,133.09420329569289,153,60,418,77.865850100773343,-45,334,null,328.59522140905034,280.47121032993607,398.01377034383461,280.03990662155394,155.94241568579525,367.05641507677933,232,125,321,-48.039906621553939,-183,107,null,356.95790553931511,307.94309788340365,429.6977503950028,461.39700884544112,321.03789751492093,642.8741469229949,330,191,448,-131.39700884544112,-348,47]
["North East","Stockton-On-Tees",237.10091247713123,183.17009721994077,401.35377050639227,142.46169706604107,116.14505500573331,202.25131550395417,183,106,367,40.538302933958931,-55,214,null,1080.6736056794794,924.33738050979161,1388.3613766201856,950.20840436643448,789.77451480589252,1092.154246494377,917,738,1176,-33.208404366434479,-258,260,null,653.2254818433895,548.55585712191123,836.89034144227696,646.65778004389745,534.26744952243143,755.8164054875441,798,618,1011,151.34221995610255,-51,392]
["North East","Sunderland",400.10212032774285,299.36350037850349,741.06547113805777,190.03973232839056,159.5759007574068,259.39674275791742,145,49,286,-45.039732328390556,-177,91,null,656.49692475650659,554,765.7972321946595,607.03581238196568,535.30506511953604,712.2585251759557,570,450,679,-37.035812381965684,-191,89,null,492.40095491575073,378,599.77448500037247,473.92445528964362,420.96917998325375,558.79039442930809,638,470,878,164.07554471035638,-21,404]
["North West","Blackburn with Darwen",127.14104143178045,110.4930978386154,175.49925118648312,104.23802244347092,81.818396347352902,164.86561098500533,83,34,168,-21.238022443470925,-106,55,null,455.8057399928324,411.94194203497989,507.96002990258853,636.63178770630486,513.10191474040471,892.01798126456629,354,262,480,-282.63178770630486,-546,-117,"*↓",714.05321857538729,657.84714110755772,794.84479673542546,676.13018985022427,530.27270179190452,912.60947291941363,926,765,1069,249.86981014977573,-16,452]
["North West","Blackpool",189.08986826985657,127.78212509827497,436.34071008001115,115.80219630181709,93.148861211514983,192.78390274570049,76,46,148,-39.802196301817091,-124,23,null,792.94940278525291,607.67217674267374,998.0767289643901,518.87101707015222,413.93043378393202,643.82753265229087,398,299,501,-120.87101707015222,-288,29,null,963.58615451959838,889,1126.6563664452096,1187.7478497391612,1000.8962540230218,1350.9082589869067,1288,1096,1472,100.25215026083879,-150,370]
["North West","Bolton",342.23559662024729,299.766819790569,444.22768257377356,286.77463085009947,211.74687739833172,475.52622976183545,243,129,538,-43.77463085009947,-265,253,null,853.48507797967716,778.28101739964063,942.69348028963395,662.40991927086964,572.93252722830641,764.47518580921349,713,532,1024,50.590080729130364,-156,370,null,1210.2793254000758,1106.4379934778574,1332.4897033349393,1176.8154498790311,1020.2082283777563,1329.5789086618663,1792,1446,2296,615.18455012096888,212,1130,"*↑"]
["North West","Bury",169.09842908244653,140.52044108980246,286.81066007471662,132.27341718041265,86.238017520788432,286.84216610954286,107,18,272,-25.27341718041265,-222,136,null,323.06998645200775,264.07306718975514,378.8276569684266,265.11088261438198,173.88764131274004,341.26162188997012,366,256,565,100.88911738561802,-23,337,null,614.83158446554569,509.66986613285667,697.24238764911706,458.90239628478986,303.49228697199135,569.97105569504276,695,505,1021,236.09760371521014,18,601,"*↑"]
["North West","Cheshire \n(Cheshire West, Cheshire East and Cheshire UA)",350.24607110527711,257.63431179139263,480.05876104058126,208.38186446957508,164.85555486293003,316.36339663052109,291,67,533,82.618135530424922,-206,324,null,1257.2612464955996,915.22646047610988,1564.1798032885636,1000.3992521248198,848.13261503110311,1197.4014224269686,909,644,1193,-91.399252124819782,-426,226,null,1781.4861776877383,1286.9577853299011,2231.8390661556095,1907.2188834056051,1711.3262342179896,2208.5904176543736,2084,1490,2742,176.78111659439492,-506,902]
["North West","Cumbria",309.03672027309619,235.02231401675422,405.55835861634256,242.62497166340017,212.2150819867787,302.75936572878112,146,92,273,-96.624971663400174,-184,24,null,1137.8856377927643,851.57836089960995,1429.8061233246995,881.43109562878885,786.13725246790784,1001.5979815260287,702,555,919,-179.43109562878885,-366,62,null,1152.3441941643669,877.02894399424963,1479.0903738505458,1261.9439327078112,1139.8746711494036,1432.0916398090524,1896,1644,2312,634.0560672921888,331,1058,"*↑"]
["North West","Halton",87.843084753673466,56.374712170186896,233.10328223910548,62.782100309275307,48.522969407888397,296.86801443332735,36,15,228,-26.782100309275307,-260,132,null,268.16801277167355,211.86057169621304,347.17056510364819,173.0662779367519,109.120808478462,220.86660583686296,180,117,265,6.9337220632480978,-69,113,null,461.988902474653,367.04410204763826,578.66265248299101,465.15162175397279,287.24514799611961,565.75542684781328,483,328,611,17.84837824602721,-151,238]
["North West","Knowsley",170.6030733616092,47.106865121638357,748.5667375560937,71.783908658081742,42.953509569023836,337.61344712924466,67,20,144,-4.7839086580817423,-271,64,null,247.35965921994941,131.23301388086426,320.43580327230353,130.34546043980811,77.678216996144272,205.81531528773405,144,89,275,13.654539560191893,-73,162,null,936.03726741844127,619,1140.0300365703583,721.27734921738158,471.46017464161184,844.55559773496088,879,671,1071,157.72265078261842,-65,468]
["North West","Lancashire",694.06630901301719,504.51702986906679,946.78100117240933,507.60899974862554,367.00839357973985,756.62054787463501,585,173,1129,77.391000251374464,-465,613,null,2253.7482162877845,1684.1830134479562,2813.1732711940786,2016.6093210690501,1504.9240031335114,2575.6677436907171,1616,1209,2003,-400.60932106905011,-1112,261,null,3575.5510847961514,2718.4671717215197,4419.6840212467532,3869.4507969158094,2958.8019000803024,4761.6706730438427,4510,3397,5801,640.54920308419059,-836,2297]
["North West","Liverpool",661.91713477187852,451.00860750468689,1016.1630577447081,413.67604362227405,308.12582260703533,592.09376090807052,331,124,693,-82.676043622274051,-403,280,null,1296.9878324509332,1038.780717317851,1628.6933196190346,1114.1785306455909,903.9454566367715,1376.5097464979328,828,629,1085,-286.17853064559085,-600,68,null,3471.9961663358358,3068,3981.8374017893375,3878.841131576386,3340.3893144993021,4378.8682134434966,4098,3480,4707,219.15886842361397,-569,1051]
["North West","Manchester",577.86144781210612,451.13280336595415,777.47181412237251,326.74795934487088,252.46379550121091,465.50705195678762,332,81,813,5.2520406551291217,-320,475,null,1074.4140853685869,886.18248066315539,1281.6406341957411,1433.478698024101,1088.8798994121566,1917.6751396759223,808,601,1051,-625.47869802410105,-1112,-205,"*↓",3195.467485880893,2686.8347101482691,3697.5988961661678,2948.4997980578614,2391.1147283739838,3470.8782035346258,3174,2467,3902,225.50020194213857,-649,1133]
["North West","Oldham",264.46323553500122,225.38026167476107,370.89570142277876,138.2404572598509,89.254166152904716,304.1425475105296,160,43,337,21.759542740149101,-201,187,null,539.34146476079582,473.99078448460517,645.94969756051239,319.37487330407612,216.33227219519651,399.58809342918278,514,384,700,194.62512669592388,54,418,"*↑",733.19529970420297,641.18413250861897,859.99410985789655,792.16361795017303,582.25571511535838,966.36980820920849,988,794,1250,195.83638204982697,-67,547]
["North West","Rochdale",172.25551192216125,126.10243121995444,265.32302312250664,140.87160072148941,95.120888878518912,321.54822601886673,116,56,311,-24.871600721489415,-207,148,null,499.13506015170793,354.06030431685292,701.20080286276857,543.75489639076159,370.47801651777269,824.39460957983624,609,402,978,65.245103609238413,-273,494,null,1011.7773279027228,841,1243.2296420714597,763.11758902050906,513.77166061545631,928.69065388921297,1105,816,1512,341.88241097949094,20,838,"*↑"]
["North West","Salford",185.5265671101082,152.66562894010303,265.3541698260766,171.36000108696817,112.52954030690726,474.57419335161381,91,17,250,-80.360001086968168,-385,78,null,510.79285127914341,443.51618848636059,611.41347613006644,387.73746225266757,296.15222258427741,476.98573434106322,335,211,504,-52.737462252667569,-201,133,null,1048.6805816107485,932.14446596475216,1233.0021961502939,1002.9025366603643,768.48994130507367,1138.5347216327855,973,689,1267,-29.902536660364262,-308,341]
["North West","Sefton",128.13165084215217,89.899202717683963,242.09877790819993,58.212712957481749,47.261236635537038,68.344383298401311,83,54,162,24.787287042518251,-6,106,null,346.57672134534641,254.21265904907861,443.25135796499387,323.23374826391182,262.42423131833823,379.49117561860083,316,238,459,-7.2337482639118207,-101,148,null,1440.4266449098334,1164.1296870601002,1739.7774508086195,1513.5305368945255,1228.7921371391869,1776.9539435105389,1287,1123,1531,-226.53053689452554,-530,148]
["North West","St. Helens",120.20998450171176,90.173245806654663,243.47444573253691,62.017037665054389,54.941743652666197,175.42663772455367,131,56,448,68.982962334945611,-79,361,null,317.58018797571219,279,377.85747995091498,364.15950422382679,295.92885916754165,440.40093316917,264,177,357,-100.15950422382679,-213,22,null,712.20982752257601,616.1707214602352,818.06915986688296,805.82345811111895,668.36626814536908,941.84824593423923,991,715,1187,185.17654188888105,-110,459]
["North West","Stockport",98.054785103474927,83.728610381757221,146.51159874909726,65.86697331330511,58.051378872985843,144.35564500763181,108,40,397,42.13302668669489,-66,319,null,477.73518039940103,400.11747060678482,596.52100320904492,430.22288338195517,359.24596243768912,567.10055279372682,397,260,646,-33.222883381955171,-238,219,null,913.21003449712384,784.17032934876306,1083.2301909511241,754.91014330473979,635.92255626727786,909.99908545226765,1013,780,1373,258.08985669526021,-27,655]
["North West","Tameside",204.22705949879861,162.95197710670391,311.96611912241576,140.16114345484368,99.694966149645055,277.04181021410864,153,59,531,12.838856545156318,-142,379,null,507.50788283055283,448.14582416828148,604.94172385988179,454.51640158684188,323.29487827673967,604.65941043123166,335,234,500,-119.51640158684188,-302,84,null,724.26505767064862,639.21178558740758,861.00489947281767,844.37585797372753,640.78675158942713,1009.0901983640513,908,643,1313,63.624142026272466,-224,518]
["North West","Trafford",33.025590551181104,null,null,22.70851063829787,18.776863659482036,30.246442984290432,97,24,162,74.291489361702133,-1,140,null,175.55708661417324,null,null,139.74468085106383,115.54993219654502,186.13196002286111,194,108,267,54.255319148936167,-47,132,null,674.41732283464569,null,null,658.54680851063824,544.52905562896092,877.14686185377639,567,335,845,-91.546808510638243,-414,225]
["North West","Warrington",112.51885524083823,93.426495811387852,155.81559787785409,43.630862386283098,37.885805305540131,54.10573600035373,41,26,154,-2.6308623862830984,-21,107,null,327.54146448457578,272.39047626067543,391.05512061680537,264.28662762575846,229.48690611133395,327.73641361088062,225,161,305,-39.286627625758456,-132,45,null,526.93968027458607,453.99593198511417,618.67014760998165,513.08250998795847,445.52279851020143,636.26307330483917,681,552,833,167.91749001204153,-17,334]
["North West","Wigan",247.05931388703615,222.38371458939585,293.41288560257925,193.12211606854268,148.3371904769856,310.47134035340969,175,52,329,-18.122116068542681,-205,130,null,676.07342573289952,623.00501912708933,753.63812737834655,617.69817479296523,468.14568361989836,761.77490529771205,540,353,819,-77.698174792965233,-311,247,null,920.86726038006429,846.38305735623794,1013.5651252350139,1058.4193036207159,816.93518210340494,1293.3252714965395,1440,1094,1769,381.58069637928406,-14,800]
["North West","Wirral",205.22964311876552,164.14115191949293,350.28967597015236,68.697545558237422,61.294977809133478,142.93726304326717,128,60,411,59.302454441762578,-35,331,null,577.46140406965128,507.17948919936805,681.16153042439157,472.35256202302475,418.97222928961605,547.87062779210783,288,223,391,-184.35256202302475,-285,-68,"*↓",2276.3089528115829,2082.3095204179344,2560.2631739391882,2350.9498924187378,2146.0918446467526,2582.3155826581465,2421,2097,2881,70.050107581262182,-324,570]
["South East","Bracknell Forest",55.634456240659489,42.037758717255194,93.812445450386633,93.862727638448547,75.143386722053378,137.08693895919177,15,5,68,-78.862727638448547,-123,-26,"*↓",113.87197579785482,81.951142875765598,164.64609584772521,75.636969105925758,60.552448932962434,110.46813609036339,146,60,250,70.363030894074242,-24,175,null,135.4935679614857,106.20950104001419,206.53097637278316,57.500303255625688,46.032835831127699,83.979453561789853,211,98,340,153.49969674437432,40,280,"*↑"]
["South East","Brighton and Hove",187.91205167657839,156.68863081838646,261.23709291343334,114.95756035149587,84.016318222162738,165.04521253481659,160,87,356,45.042439648504129,-51,243,null,579.78661026934071,495.77522178544888,730.8235084600442,421.24909499326071,309.36856052282155,559.8083386675313,587,458,744,165.75090500673929,-20,373,null,1522.301338054081,1329.6836077990772,1900.0710129543297,1493.1827435947557,1181.3059753504856,1795.2585113549931,1381,1158,1646,-112.18274359475572,-495,296]
["South East","Buckinghamshire",190.75465956343598,162.28577238198113,240.88923005909393,256.31460266695359,211.14114146904896,334.60804317698387,213,42,455,-43.31460266695359,-256,187,null,713.04232672212129,615.20961067986059,860.35115740909055,620.34190760106935,523.19241292038146,739.19026350074478,590,306,874,-30.341907601069352,-348,277,null,762.20301371444282,661.61156962343716,924.90841144357705,691.34348973197689,582.87231797462573,822.28073388843472,844,417,1452,152.65651026802311,-307,774]
["South East","East Sussex",274.95433150409815,208.43353728647878,512.72243452617704,199.87423915024942,158.03668962126153,386.52466685186141,270,74,459,70.125760849750577,-227,246,null,587.29799760995149,448.72179348767423,763.63947823728893,642.85642857697928,506.50153609995328,829.11429970205677,511,283,951,-131.85642857697928,-434,308,null,1401.7476708859504,1142.9532327255249,1769.2082461022101,1309.2693322727714,1053.5410846891707,1605.4048566720874,1515,1003,1969,205.73066772722859,-408,722]
["South East","Hampshire",728.32788178570786,383.23122190916661,1121.3238787357877,540.05785128417381,326.58472868352214,788.48506300151064,336,230,521,-204.05785128417381,-483,88,null,1440.5363801278781,875,2061.3052262080696,1536.0683488791931,919.3822974290141,2104.0735748513989,980,836,1168,-556.06834887919308,-1145,111,null,1919.5859388594488,1082.2674048570379,2781.4083592029256,1966.449187133062,1164.5463429481645,2700.0586210879528,1899,1671,2201,-67.449187133061969,-762,813]
["South East","Isle of Wight",43.449350649350649,null,null,59.183112392027326,47.822563358461863,80.601380805544636,40,7,97,-19.183112392027326,-64,39,null,324.05974025974024,null,null,278.7249174718898,225.22201747927585,379.59499286079284,129,68,198,-149.7249174718898,-276,-63,"*↓",329.4909090909091,null,null,236.09197013608295,190.77271728059588,321.53325445113438,375,225,552,138.90802986391705,-36,316]
["South East","Kent",874.15922012306635,770.11936865535779,1044.2916163124244,757.1877684187516,616.3102393707112,968.23195268108964,870,303,1474,112.8122315812484,-523,721,null,1689.4000928581077,1547.4028250233409,1851.7227060980842,1551.4911055331106,1288.075493167212,1885.6820995103512,1539,706,2866,-12.491105533110613,-917,1328,null,2053.4406870188263,1886.1923308009946,2232.495182843516,2719.3211260481376,2350.463065348079,3306.9498893250843,2789,1627,3864,69.678873951862442,-1286,1208]
["South East","Medway",265.68522386319228,221.87907505848585,368.12655466702518,125.45413638337092,96.398761319158424,181.26339186866338,530,128,1189,404.54586361662905,-6,1058,null,567.6794182764711,485.37327145628552,671.29097252261215,621.35030238684465,487.07594172149101,814.42075282546796,225,50,420,-396.35030238684465,-653,-162,"*↓",633.63535786033674,548.17977037935043,748.74954651447547,544.19556122978452,397.61344384079882,680.93434643146179,504,111,899,-40.195561229784516,-487,352]
["South East","Milton Keynes",99.940772475614963,61.732256260785171,152.62356313007413,111.9092861133969,73.970755456239829,175.23923026097819,112,51,249,9.0713886603097649E-2,-96,128,null,422.11997584618149,255.75770674476905,589.98743206815607,403.29362938955239,253.59278010928028,540.82227524086966,314,163,517,-89.293629389552393,-309,163,null,410.38764872310776,249.47097296281794,570.53843995388536,434.03346348592277,277.81306287594089,581.66491243097005,580,286,871,145.96653651407723,-178,461]
["South East","Oxfordshire",390.12906931206822,265.6971464309508,579.17596814750982,516.19834471757201,392.73214206635561,799.61027390380787,507,211,1174,-9.198344717572013,-436,601,null,1337.6335594874349,935.53472935356297,1778.2265044596263,1367.7121092703153,1135.3763127037166,1703.9375036597996,1109,585,1643,-258.7121092703153,-888,300,null,1153.885633514182,793.38904598399677,1543.753282705431,1374.0895460121126,1143.6581206958249,1707.6137011747614,1317,811,1960,-57.089546012112578,-617,613]
["South East","Portsmouth",110.90745827855376,95.792197244230422,143.79908906416236,228.45434556306245,181.79081461887654,342.27050544191735,114,68,222,-114.45434556306245,-241,-5,"*↓",457.32446986105384,398.32714823717799,550.83640340042962,540.46490418512724,433.67583716698135,689.81951737576628,551,411,782,10.535095814872761,-169,269,null,714.7680718603923,621.9117997192219,849.39141367548723,780.08075025181029,627.28134003501089,955.99491712212989,762,590,1006,-18.080750251810286,-271,273]
["South East","Reading",260.90041326887604,193.44642549134795,433.16408147088009,271.71532741799808,195.623458208888,447.60784199481992,114,71,261,-157.71532741799808,-326,-3,"*↓",560.71216277833025,446.10920008389894,714.0397223404334,450.12542614231484,339.04010092120899,556.41372459566992,457,342,679,6.8745738576851636,-134,268,null,541.3874239527936,440.68639801288151,682.59526253529225,537.99234284369663,403.90301075699551,663.09802300905937,761,599,1107,223.00765715630337,16,596,"*↑"]
["South East","Slough",196.44875033393222,156.70077700889487,319.99038104904957,121.39199431316739,81.929614771264227,247.80112687641741,52,15,124,-69.391994313167388,-200,10,null,488.63245215359115,397.50299095040469,600.49034203499423,508.79093303304387,331.17636017890447,655.00649114259647,390,205,602,-118.79093303304387,-353,142,null,380.91879751247649,311.43944629509247,470.12847831491985,414.56469601642436,275.83582158695782,590.63134970196859,445,259,696,30.435303983575636,-216,331]
["South East","Southampton",223.97930500951827,133.12788972649744,381.28260220367508,106.64801814048205,69.523415971995703,156.99030027864387,170,46,345,63.351981859517949,-78,233,null,672.54249418771747,497.69296622952072,907.15725644357872,418.31279968848594,265.61579403155434,596.26439579805447,614,373,943,195.68720031151406,-88,545,null,657.49613621324329,511,858.7555174894228,1123.7758207968741,857.86351090733194,1405.4023117403949,699,450,932,-424.77582079687409,-800,-58,"*↓"]
["South East","Surrey",357.47015219616253,288.06635827958274,453.08209425512462,340.8215094252925,298.35998423631781,404.46781577256291,268,178,427,-72.821509425292504,-183,76,null,973.26295254147351,798.44764637803212,1215.5285538290748,989.8878410725373,893.70709651711036,1127.7504551541747,1007,816,1254,17.112158927462701,-208,274,null,1631.2668952623637,1392.7793837872612,2028.6539507738196,1279.2906495021703,1157.2734697029739,1452.9576345059609,1691,1437,2027,411.70935049782975,108,750,"*↑"]
["South East","West Berkshire",90.146368458214795,73.14823922386897,124.29351149938641,99.121861233648815,71.953720203174029,192.22958220439364,12,9,23,-87.121861233648815,-179,-58,"*↓",242.65075540734645,193.26789098760773,308.03436466104733,224.80452014035893,152.7461972018782,322.06797539286208,220,159,329,-4.8045201403589317,-112,143,null,208.20287613443875,165.792820536313,262.08224998471661,292.0736186259922,205.55490943062679,414.41739320452115,292,214,418,-7.3618625992196485E-2,-125,167]
["South East","West Sussex",212.03225485369703,123,312.20687892981567,158.05908528985842,78.462385652625429,294.34214183108429,363,102,673,204.94091471014158,-109,531,null,824.18416527109025,469,1200.2369240031601,534.32809623558194,257.98152728543141,883.7469720173774,721,328,1455,186.67190376441806,-345,989,null,1299.932042436152,706,1861.5719986944698,1447.3129848530891,718.27394037256329,2083.5336808612255,1562,863,2260,114.68701514691088,-848,1140]
["South East","Windsor and Maidenhead",108.10548070540324,66.286886760206315,149.95510393684731,85.675328563304149,42.476638220140025,155.80241166568339,29,14,108,-56.675328563304149,-129,27,null,216.02097586776284,149,273.16756802129464,209.95960054245592,94.969031410958067,319.1910889694052,166,99,250,-43.959600542455917,-179,111,null,175.87354342683392,146.88745859468477,329.81187242345186,286.36507089423998,182.94774826936342,497.42479784167932,336,239,472,49.634929105760023,-180,215]
["South East","Wokingham",64.284689138508114,23.240929253822291,218.63022066520927,15.248206873474548,10.739935465803283,25.392862367192578,21,8,119,5.7517931265254525,-11,101,null,116.50229615940793,76,190.04111288194153,161.97060587589073,114.0825204011697,269.72990184840671,134,66,292,-27.970605875890726,-145,122,null,175.00198106803563,72,277.98547539625184,188.78118725063467,132.96630920876854,314.37760496443514,185,104,373,-3.7811872506346731,-146,182]
["South West","Bath and North East Somerset",162.59778302829761,115.02706014253266,367.70142218662448,110.22348925647992,81.811958491634982,337.00734802155756,33,18,132,-77.223489256479922,-299,6,null,323.72619724867951,232,430.02537067432741,331.25913611913484,272.10942217970694,541.25327953369617,436,285,755,104.74086388086516,-142,376,null,546.62691666837247,378,688.57769023033461,792.51737462438518,549.98081593118127,1008.6708955279339,538,350,909,-254.51737462438518,-521,249]
["South West","Bournemouth",146.95317155563635,132.9830097672604,178.97612354485221,141.31877840999553,99.573953096118132,460.59539395329017,239,107,680,97.681221590004469,-205,525,null,666.92808055310263,615.86743506699327,739.59664810850848,610.17253303870166,492.59789276756584,693.0759225330271,480,343,660,-130.17253303870166,-284,106,null,1107.1187478912609,1027.8662352935512,1216.7202443038191,1141.549824392725,917.68315216820031,1290.9846770315769,1135,841,1514,-6.549824392724986,-330,469]
["South West","Bristol, City of",497.31203756435735,423.65778015167984,591.17007782674659,1034.0817620758794,598.15844314588946,1775.5127818719222,531,330,934,-503.0817620758794,-1216,83,null,1982.2943065721943,1685.041670753317,2266.1542144989362,2023.0875335038231,1622.9210267700398,2423.8389236026114,1396,1097,1643,-627.08753350382312,-1115,-153,"*↓",2509.5468300428938,2143.861429280073,2865.8218395984368,2306.830704420297,1822.7044253272534,2720.2829104087587,2782,2307,3239,475.16929557970298,-182,1079]
["South West","Cornwall (UA) and \nIsles of Scilly (UA)",216.12695399531108,181.42733997286902,282.87566877126881,132.40810658811867,122.57323966509308,191.70673144832557,213,124,436,80.59189341188133,-36,283,null,778.36128526986136,679.49261515036369,918.08906667607846,664.11011395708613,583.73220835281973,788.21217849319817,592,452,817,-72.110113957086128,-261,157,null,1265.5117607348275,1115.334085679151,1461.9306984803102,1085.4817794547951,966.09891110911019,1256.6615540493697,1306,1064,1654,220.51822054520494,-80,586]
["South West","Devon",265.27888431649876,232.27115041501659,338.5686290695993,159.76657751430562,136.68874201462728,213.3778474016257,96,65,180,-63.766577514305624,-125,11,null,790.17380031979883,702.48354141506695,902.68413216772001,820.31628521624191,725.60959094849522,976.50436609241069,538,427,703,-282.31628521624191,-464,-103,"*↓",1061.5473153637024,948.90732679060056,1203.0437045619167,1219.9171372694527,1083.7945487572715,1447.1308813385051,1513,1320,1785,293.08286273054728,9,586,"*↑"]
["South West","Dorset",132.19338623672255,110.11634941907515,183.87105733018663,109.94101948774788,89.621005457883129,150.24223442973221,121,62,329,11.05898051225212,-62,217,null,579.41613934075019,504.66614777161413,695.65687185149193,441.90317046684305,365.22429710793318,534.70780528238879,520,376,796,78.096829533156949,-87,370,null,724.3904744225274,636.37235594551873,849.55634338551056,834.155810045409,722.2789289286186,970.00858246451514,1006,796,1476,171.844189954591,-79,604]
["South West","Gloucestershire",416.97189839970508,300.07069718089787,591.29193771735561,503.32466063139753,211.85169205582767,1110.2850255159701,352,109,578,-151.32466063139753,-872,242,null,1322.7889637403036,950.46755744660766,1665.7089712129723,1080.5042138578929,647.42357110671594,1502.618190637648,907,528,1589,-173.50421385789286,-702,619,null,1216.3514402718627,890,1587.5804892359242,1060.6373590200997,653.85380904646524,1446.9746359925923,1570,1043,2043,509.36264097990033,-147,1138]
["South West","North Somerset",182.39882460255512,146.2568996407243,348.11063989036205,53.947037845651337,44.845936580945576,99.729974592557838,122,21,281,68.052962154348663,-50,221,null,351.10549993230927,284.75370447755557,432.14406602834555,359.59863298155335,306.14044879244159,427.84310895830458,322,218,494,-37.598632981553351,-160,147,null,632.49567546513572,523.93624539889788,766.28735280493981,575.45432917279538,498.90085116901008,674.25732200721654,823,630,1173,247.54567082720462,26,618,"*↑"]
["South West","Plymouth",263.4404307525819,221.88953515238586,318.4555389756938,201.89066518596121,177.86279845793334,242.43256985966281,137,74,395,-64.890665185961211,-146,190,null,819.43041347781059,692.73542802630095,955.36580299551576,686.09230783751752,609.60387506257712,767.4982160744047,662,531,852,-24.092307837517524,-169,183,null,1288.6812924205044,1081.9962378584758,1485.4262592509426,1196.0170269765215,1087.0099042589079,1318.9515359890913,1309,1109,1598,112.98297302347851,-129,433]
["South West","Poole",30.039718372257894,26,44.725157261257479,30.643799219178678,24.542477846356906,41.324807065661133,18,9,56,-12.643799219178678,-26,26,null,159.87036686144518,138,212.09066516405153,224.6469270290834,179.9186896555095,302.94843023049367,166,88,380,-58.6469270290834,-163,172,null,356.08991476629694,287.39687128981291,487.55800307797477,277.70927375173795,222.41607867338755,374.50585051024132,374,245,775,96.290726248262047,-51,501]
["South West","Somerset",297.41664675480411,248.07418319971646,371.63351226605795,185.78102741322652,160.70452473377085,228.86871425789252,124,80,221,-61.781027413226525,-126,32,null,753.38084266694989,662.27359423717837,888.94052602202987,624.98573491871821,542.71156361268868,714.75561909377848,657,449,974,32.014265081281792,-196,376,null,1005.2025105782457,886.71602845636039,1172.7120277744095,1033.2332376680554,929.00473093621054,1162.8964548691322,1148,851,1482,114.76676233194462,-212,453]
["South West","South Gloucestershire",74.805537019240418,56,184.48056249109987,113.71407584230248,65.363060769606733,232.66064995277046,121,25,301,7.2859241576975222,-153,190,null,715.40472165433971,487.53466999128455,1041.6751711085251,439.80960016729279,231.81209383710305,603.83391320070211,346,179,557,-93.809600167292785,-319,231,null,459.78974132642003,297.47628885041007,746.87556891189979,342.78182293316149,195.72304024973465,572.06429618958452,576,326,869,233.21817706683851,-94,535]
["South West","Swindon",136.87577020694607,117.75352520149796,175.88585107743899,209.79342703475587,164.69728746187172,319.45800899748571,92,41,283,-117.79342703475587,-245,70,null,452.29808610180748,379.54448194325505,554.03936470712017,511.85312436547753,400.46673201578341,612.37173212613686,401,216,580,-110.85312436547753,-307,99,null,427.82614369124639,366.20308080860872,537.29929140557522,425.35344859976664,342.20977618333092,560.33808748799277,660,417,930,234.64655140023336,-47,510]
["South West","Torbay",41.429120717842025,38,47.5394141727961,35.064011866668373,31.606888556010723,41.475339783459958,85,25,487,49.935988133331627,-11,449,null,304.71321053580948,270.38591249250396,354.66175709257601,266.04197200652658,239.8116597023855,314.68678267922758,210,90,298,-56.041972006526578,-186,33,null,568.85766874634851,514.26857193773947,654.68467173895067,512.89401612680513,462.32541623712763,606.67482960191194,480,212,613,-32.894016126805127,-317,99]
["South West","Wiltshire",132.78979363201202,106.68670853085676,184.33230513263945,100.68146064192878,83.993716311351079,138.56025854548471,121,57,426,20.31853935807122,-57,322,null,561.81717215570302,462.59348250723065,766.09510205077402,430.39914312602815,354.95002332804933,534.7641013971014,651,462,1340,220.60085687397185,16,911,"*↑",650.39303421228487,543.85908015486916,874.27869966417563,608.91939623204314,515.42710363745198,744.04827727166912,713,523,1433,104.08060376795686,-138,819]
["West Midlands","Birmingham",1275.5253653032705,1003.5548279987074,1681.2867148340556,921.14892671678354,765.82153761347388,1106.1163630498859,851,246,1587,-70.148926716783535,-740,678,null,4557.3826139739322,3834.0804467356861,5334.1864092528967,5013.8061712775889,4223.6871423913499,5788.2168107603993,2961,2239,3629,-2052.8061712775889,-3033,-1056,"*↓",4429.9258588152561,3744.4048605054199,5168.768491222022,4808.3219436129675,4077.8862776069532,5539.5526959063181,5893,4618,7520,1084.6780563870325,-408,2908]
["West Midlands","Coventry",205.80414226459885,137.61556380890258,298.23051716800637,84.014606283943792,50.161828936205872,130.77935289233184,167,109,293,82.985393716056208,7,210,"*↑",1050.2218017031291,748.30026738560332,1433.7504072451659,675.55388995130056,366.78981126007818,1075.9909934293698,536,453,659,-139.55388995130056,-545,182,null,868.45708284132786,676,1161.670966786126,1175.5752101443309,789.75162305354115,1578.8313445435742,1171,1020,1365,-4.5752101443308675,-451,426]
["West Midlands","Dudley",357.42936425905157,255.93589275089079,519.52212609718231,235.77350868088837,186.0688712168523,332.67949418520823,136,82,263,-99.773508680888369,-204,31,null,932.97935656493564,719.9834712988212,1141.8837717551726,927.9646129958295,776.07538906625132,1140.8230917412884,1005,730,1258,77.035387004170502,-260,384,null,622.1837011636253,466.98123938699365,765.14440106701113,757.26187832328208,624.87974282465098,952.21734135157396,869,654,1123,111.73812167671792,-167,390]
["West Midlands","Herefordshire, County of",95.970783633160806,80.403962991170815,128.03862569616169,77.294691536496785,64.261865756708815,222.05748276403892,81,23,176,3.705308463503215,-153,81,null,363.32986358205551,313.38360471196057,447.69076893473493,276.73432169054229,202.12702930671529,330.15621064947322,346,217,666,69.265678309457712,-69,423,null,387.69935278478368,336.63692133186856,478.97832760785866,364.97098677296088,271.66366786852171,437.45655065567149,515,354,829,150.02901322703912,-35,467]
["West Midlands","Sandwell",492.75263150523369,360.5130907844644,734.28588755283761,243.2321391108695,177.56236516830805,337.7831848125349,194,105,397,-49.232139110869497,-181,162,null,963.90318603721062,760.44559523082705,1165.0394017054834,1206.8870969384982,923.55698750071792,1491.9269426553114,981,706,1289,-225.88709693849819,-621,208,null,590.02476128685328,451.91010512342768,738.91093839340249,691.07908329131419,511.04281036383418,940.92565178250584,976,669,1297,284.92091670868581,-105,656]
["West Midlands","Shropshire",153.17463051137904,134.6254115142481,189.45345458275864,84.812359233217776,72.499153304226184,131.98688157573329,106,70,236,21.187640766782224,-39,141,null,481.70618160374408,423.14124261486677,553.48140918171873,372.54350677844326,317.04503317168474,425.34196677257432,462,364,599,89.456493221556741,-20,239,null,488.11918788487691,434.89442703480529,561.88150686756671,405.64413398833898,354.36103061303203,479.41562483020499,634,524,795,228.35586601166102,93,401,"*↑"]
["West Midlands","Solihull",102.15826770012497,87.435349599933176,179.77389580925333,124.80358036712829,39.391804253703896,498.29554055136231,105,19,256,-19.803580367128291,-419,168,null,497.15437796630033,406.10008354314726,581.98781082215862,330.53241590853764,152.31040082324282,437.38706118576425,360,210,545,29.467584091462356,-154,275,null,297.68735433357466,246.19360982330363,358.01032287015772,284.66400372433407,125.68951168563096,387.35985222661805,496,318,708,211.33599627566593,1,478,"*↑"]
["West Midlands","Staffordshire",591.23291470325705,518.76002811583544,723.81086505816108,380.2249964574936,263.97385737487957,539.30982400583616,248,142,442,-132.2249964574936,-330,91,null,1319.8842391102194,1203.7861891377845,1479.1123575964248,1413.1446651236604,958.74461500768052,1896.9730966042398,1455,1036,2062,41.855334876339612,-608,876,null,1111.8828461865235,1020.2394887954639,1249.9141909554021,1446.3992775058712,966.08650007367964,1924.2799159116244,1743,1155,2277,296.60072249412883,-462,1022]
["West Midlands","Stoke-on-Trent",247.89047056493916,228.43066395904975,283.6706691388743,251.53827652819066,219.18370886074257,331.24844081552783,207,121,400,-44.538276528190664,-168,130,null,981.32067829735774,921.09899800837616,1064.0647941710461,956.05973953597186,863.84723764932221,1116.5711612969658,897,680,1115,-59.059739535971858,-332,158,null,991.7888511377032,931.84188215565723,1070.9835778792381,1136.4019839358377,1037.1778420188589,1325.3324112193391,1550,1273,1852,413.59801606416227,82,735,"*↑"]
["West Midlands","Telford and Wrekin",99.577669872373107,56.808488770521308,218.71155890471448,48.550323933015477,34.85889157238919,192.87419804085684,85,51,181,36.449676066984523,-120,124,null,341.81040688534466,238,469.19241144256131,360.08410094782027,274.97498219869834,541.09980148581656,292,220,403,-68.084100947820275,-252,64,null,578.24054638890709,402.59002087257971,771.89059088117324,358.36557511916425,266.30494955445317,553.16442250818807,552,455,743,193.63442488083575,6,417,"*↑"]
["West Midlands","Walsall",343.31145181527472,273.57299136377071,435.44710814293734,327.95539263519532,222.92708421977014,571.72609295876362,171,110,308,-156.95539263519532,-410,5,null,1075.379949888129,885.55685907115833,1251.9693077334227,1046.1205490130535,858.17100025922673,1283.5898715254636,864,730,1070,-182.12054901305351,-445,107,null,688.2703686023475,566.88789207334435,813.58822194015045,811.92405835175089,653.45125412652067,1010.8734802405437,871,724,1039,59.075941648249113,-180,288]
["West Midlands","Warwickshire",359.99422963153586,306.23627832383545,477.64674893845375,140.09009847873619,113.06928215827084,217.65985830564699,189,111,384,48.909901521263805,-67,234,null,893.05872602588477,788.14417837663677,1038.8734839390922,949.35748338601638,797.79971066914652,1166.0101345381406,655,503,862,-294.35748338601638,-554,-57,"*↓",932.94704434257915,823.35541705835544,1086.6593357703409,715.55241813524754,567.6350118014991,875.43385936063123,1256,1033,1579,540.44758186475246,270,922,"*↑"]
["West Midlands","Wolverhampton",375.01042880297729,317.68565322310207,484.36050096558745,283.42704053907704,230.15040039886935,360.17860229938526,201,136,329,-82.427040539077041,-188,53,null,953.94197983855406,860.58596522488915,1068.6730446374925,1221.6685551036562,1015.9045691097098,1432.7952801537369,713,520,938,-508.66855510365622,-771,-209,"*↓",806.04759135846859,722.4923942237026,914.91122825426044,776.44278457078508,643.20752290728285,905.07374738356816,1258,1037,1601,481.55721542921492,240,841,"*↑"]
["West Midlands","Worcestershire",305.85682665765279,215.81152687006224,401.72052631653202,166.32390336427824,126.06769339470239,236.24087334315325,208,111,422,41.676096635721763,-81,250,null,1152.060123342598,807.99650328914049,1496.2481142923955,935.91452092732652,698.24190213494796,1279.1725847033713,887,559,1342,-48.914520927326521,-545,459,null,1134.536093938874,786.82710421023216,1501.853990906299,1540.7615757083954,1246.1632192062518,2025.1344302539678,1675,1035,2262,134.23842429160459,-647,763]
["Yorkshire and the Humber","Barnsley",150.78287271762855,131.45075998081236,203.18535879020857,120.86682627201405,98.872505034951089,263.11459419274905,161,76,490,40.133173727985948,-113,349,null,776.37333463538687,680.53002555480816,898.72833669890235,786.57604760542802,653.90473025452127,985.04651291400012,775,577,1003,-11.576047605428016,-282,254,null,581.84379264698464,511.8107291340915,697.20092615490307,810.55712612255786,674.39840036221972,992.2510395402071,915,683,1154,104.44287387744214,-181,368]
["Yorkshire and the Humber","Bradford",1006.0442086139425,660.42473874460575,1521.4946990278202,324.99527879617403,280.04167218253417,403.77845478865083,404,187,762,79.004721203825966,-164,439,null,2036.7206387030369,1631.1023972371258,2455.7119015763856,1958.3588890805636,1725.1228774212827,2246.4179387702943,1285,913,1617,-673.35888908056359,-1115,-272,"*↓",1639.8284826262252,1608,1970.6873023401181,2157.6458321232626,1925.2498713411392,2436.8548549275561,3096,2406,3899,938.35416787673739,143,1778,"*↑"]
["Yorkshire and the Humber","Calderdale",114.35854742006148,97.506793037058344,175.74039336299913,62.116250534019741,55.22822476867325,93.325150644966385,75,47,166,12.883749465980259,-32,102,null,417.55056533563118,370.64679954651865,477.90465593961261,355.82842414643841,316.17883150088136,404.3676594983159,433,314,565,77.171575853561592,-50,217,null,583.0908872443074,521.54038807769393,664.3500926620859,640.05532531954191,572.12701197570141,717.37702241066484,1048,811,1262,407.94467468045809,164,635,"*↑"]
["Yorkshire and the Humber","Doncaster",432.03434252432061,329.5089491944222,636.97009552279178,223.3294500719627,148.13656507792328,751.59866841720577,264,112,580,40.670549928037303,-525,363,null,1090.0286018882518,972.07877886234542,1209.7397823516055,993.92729056321002,729.43770263682586,1104.4523722485851,669,430,969,-324.92729056321002,-576,57,null,920.93705558742761,816.84462926189826,1040.2102948164747,1058.7432593648273,785.59125427146398,1210.2511773739782,1404,1009,1830,345.25674063517272,-55,818]
["Yorkshire and the Humber","East Riding of Yorkshire",132.72683532880927,109.89176992195632,189.32928009077796,78.232210912197019,62.743009282572075,154.91886111346921,52,31,123,-26.232210912197019,-105,38,null,452.32956825624626,372.72579078577007,536.33800994628666,465.99391895469353,360.03948066963466,626.46005804648905,284,208,391,-181.99391895469353,-344,-29,"*↓",542.94359641494441,448.86419285097992,660.27483561090105,616.77387013310943,499.76169055538321,864.89694097482175,609,497,799,-7.7738701331094262,-282,218]
["Yorkshire and the Humber","Kingston upon Hull, City of",301.56501566374845,261.37911835794478,344.48424610946302,294.96351053758411,256.25167469834633,355.16232592713914,137,102,200,-157.96351053758411,-224,-86,"*↓",1435.3799982487319,1258.5078781460627,1604.7827618658953,1339.2697229346104,1186.0327095931434,1492.1729798972017,913,748,1106,-426.2697229346104,-639,-171,"*↓",1578.5953983548318,1376.2550000369797,1773.73982626613,1594.5252254113439,1409.288595444066,1778.9735634589942,2259,1889,2580,664.47477458865615,244,1035,"*↑"]
["Yorkshire and the Humber","Kirklees",202.34743565148511,179.50038182375667,244.65846334878123,235.47603502190745,164.43239160153001,372.65724397113087,198,39,468,-37.47603502190745,-285,231,null,1082.3589795999133,995.49742276460313,1198.2811345238053,926.38734216751493,668.67671892370549,1204.1500786419615,742,542,1018,-184.38734216751493,-516,197,null,1056.2935847486019,964.17415812797924,1168.0217398946274,1362.3728775796274,1020.4501170872495,1740.8795310020478,1547,1281,1984,184.62712242037264,-283,760]
["Yorkshire and the Humber","Leeds",675.97425740917026,515.0755544973598,888.32059056903188,528.41524816493666,403.80641283241317,732.46729750875045,551,169,1138,22.584751835063344,-455,599,null,2209.9697021550801,1720.8657708322958,2713.9592694919006,2299.7545146658754,1840.2289576138523,2764.9888333568488,1760,1238,2194,-539.75451466587538,-1249,93,null,2329.1189903507911,1799.6444355557203,2853.5042992267108,2648.0325244666146,2165.686763554053,3135.6086298188643,3206,2314,4331,557.96747553338537,-489,1795]
["Yorkshire and the Humber","North East Lincolnshire",144.0828261256932,123.75248464169199,177.09573150129646,120.90343068084456,95.281108904676515,165.50935261898016,114,41,422,-6.9034306808445649,-97,303,null,563.60233579905446,496,631.29179528219402,853.16636257666244,683.50824893475806,1022.8039730300194,445,300,571,-408.16636257666244,-632,-188,"*↓",594.31483807525228,540.56479275238416,715.40165059946139,612.73483291914442,470.3114124463375,736.9317639665145,910,650,1106,297.26516708085558,1,521,"*↑"]
["Yorkshire and the Humber","North Lincolnshire",177.0154403049728,157.06655856499816,218.49825641427847,102.92131009771155,68.696003182901507,166.2801419762599,153,89,299,50.078689902288446,-45,198,null,437.71259758660835,398.29893194044996,500.22425981102157,357.14923843264944,232.87759053955,460.88028301235801,554,413,692,196.85076156735056,23,376,"*↑",450.2719621084189,411.17218897739127,517.67749305706025,735.74287654073839,589.36522511055307,907.06944865625815,614,471,764,-121.74287654073839,-362,81]
["Yorkshire and the Humber","North Yorkshire",184.49113829512299,166.59085462645714,218.64111492667377,185.34970300748409,123.20832327517391,273.50032739996641,172,110,315,-13.349703007484095,-122,142,null,762.49055276258866,699.3366430149058,854.6495471389311,803.52561343604179,527.09103901432832,1096.7081518671437,573,451,729,-230.52561343604179,-545,81,null,856.0183089422884,785.1087480631395,964.73090767739177,1077.4852776988901,696.05114829046784,1460.6862027812456,1208,1031,1460,130.51472230110994,-272,608]
["Yorkshire and the Humber","Rotherham",185.6464542548251,156.40432485382746,298.65532475866485,162.52377964836575,132.44384995108183,412.622951620702,86,58,181,-76.523779648365746,-331,-3,"*↓",734.25725624100335,663.84206036577893,850.36756234328141,731.9196807562621,595.78089256471685,1012.863971037637,803,629,1090,71.080319243737904,-256,369,null,769.09628950417164,692.90758534069903,899.34772692057436,754.55653959537221,604.17174355130931,1046.4312478293625,1015,816,1323,260.44346040462779,-68,598]
["Yorkshire and the Humber","Sheffield",593.01094801263446,460.93600609253519,799.44195873861167,154.55686012143832,130.74495564895125,226.52234224625417,379,68,950,224.44313987856168,-111,786,null,1395.2032888682102,1071.6250378594812,1706.035674409919,1606.124461519732,1413.4606959184041,1849.679486448194,1088,798,1443,-518.12446151973199,-895,-120,"*↓",2029.0259721672364,1587.7109418757875,2460.8825877375666,2505.3186783588303,2249.9419591202104,2873.1307981075474,2201,1599,2833,-304.31867835883031,-1002,364]
["Yorkshire and the Humber","Wakefield",383.40906581234549,312.64295195558816,474.61474558865274,311.74656254742047,260.61684357139711,475.19803875763932,221,134,425,-90.746562547420467,-281,92,null,1268.7445238099833,1039.0578603792994,1499.6422177113377,1237.4710348993904,1085.6998036785062,1437.0402144194729,921,774,1114,-316.47103489939036,-549,-72,"*↓",1115.0682029296036,917.10822998009746,1322.1344605951049,951.78240255318929,834.87339568694313,1126.8105201616338,1492,1285,1737,540.21759744681071,272,824,"*↑"]
["Yorkshire and the Humber","York",110.37439839968916,95.37778877831704,242.78390648055924,76.284619202471674,63.894727440152316,208.48045800681354,125,72,285,48.715380797528326,-81,190,null,404.46191311974724,330.2230394691386,444.07026108057437,582.780387307968,457.27575026153346,796.01171624859899,325,261,442,-257.780387307968,-488,-76,"*↓",400.16368848056362,344,442.37365507731857,462.93499348956027,359.2045911061586,626.8382309993392,476,384,637,13.06500651043973,-170,204]
["East of England","East of England",3795.397361313926,3226.7286175415911,4467.8291423598084,2545.7598411971207,2194.9170420333103,3157.2584905108602,2960,2129,3955,414.24015880287925,-672,1277,null,8600.1397261160619,7621.0275864688338,9672.7384002579747,7774.7188124881204,7016.8111357915714,8617.0080040536413,8068,7038,9633,293.28118751187958,-1087,2182,null,11455.843103017995,10164.322118726781,12879.882103018428,11631.2409188407,10460.570894109032,12921.466180757572,14882,13143,16589,3250.7590811593,833,5400,"*↑"]
["East Midlands","East Midlands",3545.0855309812441,3106.1586173628129,4280.1076974270745,3086.5014873492951,2604.4744770118664,3936.660716355274,3192,2256,4765,105.49851265070492,-1213,1640,null,10592.305624850846,9659.9122441986419,11502.12383810949,10495.236177640671,9444.7837769152065,11385.815449500198,8211,7259,9674,-2284.2361776406706,-3524,-507,"*↓",10070.512414125244,9249.4919663295168,10919.088870359554,10503.639396769422,9436.4763410749274,11371.538158503359,13654,11951,15092,3150.3606032305779,1087,4960,"*↑"]
["London","London",8393.524441649457,7727.5921107464364,9101.7266915885339,7648.1987161163779,7075.9607298632409,8956.9438184236551,6089,5553,7645,-1559.1987161163779,-2963,-408,"*↓",16865.013527090272,16001.666695882946,17638.707098139792,17659.907211548325,16956.541805677476,18732.494111252719,14994,14113,16314,-2665.907211548325,-4095,-1309,"*↓",27364.246031998548,26022.700151067889,28406.165797765094,29676.591718380234,28452.381005462365,30988.303244546889,31404,29887,33359,1727.4082816197661,-100,4017]
["North East","North East",2793.0225375935511,2537.3761422718494,3160.8699486786682,2093.1428327734488,1904.3098584453601,2480.796471078444,1727,1470,2422,-366.14283277344884,-844,204,null,8971.9459226853469,8519.7208264491201,9657.0952206304319,7987.5505534738259,7565.8468121314263,8310.3667100088733,6842,6336,7611,-1145.5505534738259,-1696,-197,"*↓",6525.1752669187817,6198.5298564354161,7076.244797450754,6854.2055605953201,6545.7027358816276,7265.3307264928098,9106,8479,9975,2251.7944394046799,1522,3154,"*↑"]
["North West","North West",5449.8409738062182,4925.9692761047709,6162.1011249086987,3577.5830757022572,3158.886519039746,4585.2888313512931,3580,2923,4920,2.416924297742753,-1313,895,null,14916.437627241023,14109.743527645702,15836.563255155315,13149.614057227473,12361.805338263572,14089.092889375774,11035,10317,12182,-2114.6140572274726,-3216,-741,"*↓",29059.919551837418,27566.397621565218,30444.473951487224,29609.801653841238,27882.885436251378,30755.029445259348,34199,32301,36418,4589.1983461587624,2512,7664,"*↑"]
["South East","South East",4735.2218894366388,4222.9122201960117,5267.3424227349287,4202.1353059367284,3797.0047594792468,4931.3783710204871,4196,3181,5433,-6.1353059367284004,-1329,1161,null,12327.260801482858,11354.468275330599,13373.743281931078,11557.369540123938,10728.234624386152,12549.166598682976,10390,9153,12356,-1167.3695401239384,-2845,923,null,16107.019533549505,15076.137966089671,17663.389762953742,17175.713843935166,15949.609207548268,18479.469433911265,18148,16510,20110,972.28615606483436,-1133,3244]
["South West","South West",2996.6299571547684,2752.7878660633046,3284.483750954214,3122.5798990135977,2482.3324621497086,4364.7650840926435,2405,2033,3435,-717.5798990135977,-1850,341,null,10561.709086430865,9927.6670412615022,11311.073774649329,9514.780428591921,8871.3871665507231,10204.05650474333,8284,7678,9619,-1230.780428591921,-2085,226,null,13820.429466601927,13177.749955462392,14627.563858690126,13413.452540688051,12620.299341389611,14244.773736520136,15933,14983,17607,2519.5474593119488,1268,4426,"*↑"]
["West Midlands","West Midlands",5005.6891772248291,4607.4568347265604,5531.2928243334982,3369.1898438653147,3002.9980191363661,4104.7953905867807,2949,2301,3948,-420.18984386531474,-1381,488,null,15564.133484819395,14550.216564957436,16548.564138744379,15686.371629578247,14670.559970523311,16811.884052890615,12414,11412,13768,-3272.3716295782469,-4778,-1592,"*↓",13927.810641065702,12982.549870668618,14888.046695073483,15273.36491318458,14167.428485066423,16500.452864116185,19459,17724,21581,4185.6350868154204,2024,6583,"*↑"]
["Yorkshire and the Humber","Yorkshire and the Humber",4793.8637865344508,4261.2835922620661,5401.6924264948993,2982.6810756165323,2652.82585494471,3851.9273983058442,3092,2403,4311,109.31892438346767,-1052,1040,null,15067.183857009473,14276.505303016344,15877.987545356351,15298.232929047042,14463.532707919709,16135.715939965416,11570,10639,12441,-3728.2329290470425,-4922,-2560,"*↓",15446.611050181647,14665.055586639963,16352.476161709821,17989.26164167661,17101.116765403869,19015.13037199077,22000,20413,23649,4010.7383583233895,2034,5769,"*↑"]
["ENGLAND","ENGLAND",41508.27565569507,39858.628433669932,43140.524572007962,32627.772077570662,31168.14913824715,36991.572635149118,30190,28906,34829,-2437.7720775706621,-6720,89,null,113466.12965772615,110866.6723376435,116238.32864386178,109123.78133971953,106529.61110581463,111794.70184207417,91808,89650,96413,-17315.781339719528,-20555,-11788,"*↓",143777.56705929671,140952.15495757668,147331.1676486113,152127.27218791144,148575.77634288979,155155.6854681164,178785,174685,184519,26657.72781208856,21576,33419,"*↑"]

{"sheet":"Opiate by Age","index":10,"n_rows":167,"n_cols":41,"rows_kept":167,"cut":false,"hidden":false,"merged":[[4,2,4,14],[4,15,4,27],[4,28,4,40],[5,37,5,40],[6,37,7,37],[6,38,7,38],[6,39,7,39],[6,40,7,40],[6,20,7,20],[6,21,7,21],[6,31,7,31],[6,22,7,22],[5,21,5,23],[6,28,7,28],[6,23,7,23],[5,18,5,20],[5,24,5,27],[6,24,7,24],[6,25,7,25],[6,26,7,26],[6,27,7,27],[6,18,7,18],[6,19,7,19],[6,10,7,10],[6,9,7,9],[6,15,7,15],[6,11,7,11],[6,12,7,12],[6,13,7,13],[6,14,7,14],[4,0,7,0],[6,2,7,2],[4,1,7,1],[6,17,7,17],[6,16,7,16],[5,2,5,4],[6,3,7,3],[6,4,7,4],[6,8,7,8],[5,5,5,7],[6,5,7,5],[6,6,7,6],[6,7,7,7],[5,15,5,17],[5,8,5,10],[5,11,5,14],[5,34,5,36],[6,30,7,30],[6,29,7,29],[5,28,5,30],[5,31,5,33],[6,32,7,32],[6,33,7,33],[6,36,7,36],[6,35,7,35],[6,34,7,34]]}
["National and local estimated number of opiate users by age band with 95% confidence intervals (CI) - 2010 -2015"]
[]
[]
[]
["Region","Local authority","15-24",null,null,null,null,null,null,null,null,null,null,null,null,"25-34",null,null,null,null,null,null,null,null,null,null,null,null,"35-64"]
[null,null,"2010/11",null,null,"2011/12",null,null,"2014/15",null,null,"Difference between 2014/15 and 2011/12 ",null,null,null,"2010/11",null,null,"2011/12",null,null,"2014/15",null,null,"Difference between 2014/15 and 2011/12 ",null,null,null,"2010/11",null,null,"2011/12",null,null,"2014/15",null,null,"Difference between 2014/15 and 2011/12 "]
[null,null,"Opiate users","Lower bound  95% CI","Upper bound  95% CI","Opiate users","Lower bound  95% CI","Upper bound  95% CI","Opiate users","Lower bound  95% CI","Upper bound  95% CI","Difference","Lower bound  95% CI","Upper bound  95% CI","Significance","Opiate users","Lower bound  95% CI","Upper bound  95% CI","Opiate users","Lower bound  95% CI","Upper bound  95% CI","Opiate users","Lower bound  95% CI","Upper bound  95% CI","Difference","Lower bound  95% CI","Upper bound  95% CI","Significance","Opiate users","Lower bound  95% CI","Upper bound  95% CI","Opiate users","Lower bound  95% CI","Upper bound  95% CI","Opiate users","Lower bound  95% CI","Upper bound  95% CI","Difference","Lower bound  95% CI","Upper bound  95% CI","Significance"]
[]
["East Midlands","Derby",367.10454899404584,248.1002143214493,593.51487276233502,248.3628217657531,218.9765814723942,297.09424284783222,190,128,323,-58.362821765753097,-135,81,null,839.10368284103026,665.15599180658978,994.57331901535747,899.0290826254452,810.10534671704386,1000.2437690266304,803,682,991,-96.029082625445199,-244,111,null,741.82645569136014,628,880.60430032419265,946.6080956088017,851.38828664889093,1059.3091824892704,996,864,1204,49.391904391198295,-122,273]
["East Midlands","Derbyshire",364.26353360166769,260.53951409996279,482.98617859184662,265.87299609503384,194.04448186725281,348.56690735527923,177,107,289,-88.872996095033841,-193,39,null,1580.2123724054386,1152.1895450356894,2002.9007502411059,1809.3003866242109,1322.2970677429114,2284.2613658531795,1134,727,1748,-675.30038662421089,-1299,75,null,1263.5852205173856,932.77074174593065,1633.2784806153641,1255.8006955300662,923.82917387213183,1593.4563576256023,2170,1486,2817,914.19930446993385,172,1666,"*↑"]
["East Midlands","Leicester",281.87046133824492,211.10726415030959,433.12361467300894,297.21083021428086,220.08163465079738,443.98701948701881,115,79,190,-182.21083021428086,-328,-80,"*↓",981.03012398901797,767.56810366455477,1227.2415106189114,1300.5908933464632,1047.0108120023008,1556.8981278720164,792,609,1057,-508.59089334646319,-844,-156,"*↓",1176.0994146727373,938.6604045686496,1453.5571059792976,934.79192184786712,738.09747384311561,1116.6771775238899,1391,1068,1687,456.20807815213288,90,804,"*↑"]
["East Midlands","Leicestershire",229.3946377273152,210.90437296830126,257.98471391660547,147.58188239689417,134.70520718671972,247.53032274723918,244,48,557,96.418117603105827,-138,394,null,862.10885151398895,801.1706293002527,937.67359242682994,812.99418748675168,720.3367399445716,920.07065254831491,833,479,1365,20.005812513248316,-340,562,null,756.49651075869576,699.82738718959581,827.7874606049262,704.42393011635397,616.89241970301225,790.77435419703568,1208,652,1791,503.57606988364603,-45,1098]
["East Midlands","Lincolnshire",268.84473701916596,195.40030354805594,353.06708100133625,483.37410950205998,307.87177283903009,809.63357253915649,251,83,561,-232.37410950205998,-537,32,null,1237.1281209453609,934,1567.037089297846,1149.3191143840752,816.53197230814567,1501.4207203064791,1062,683,1589,-87.319114384075192,-674,598,null,1204.4528335160958,902.46021478956004,1524.3265692795799,1129.3287358845791,800.19943468291967,1473.9694948256144,1616,1120,2142,486.67126411542085,-164,1177]
["East Midlands","Northamptonshire",231.98442008656488,204.88303201832994,293.65400391069744,250.02134787043826,180.41819346315506,385.1338678758629,177,43,423,-73.021347870438262,-222,116,null,1121.0985497622021,1043.566852720762,1233.6984082091537,904.98311050240454,644.2918955854351,1155.3967389256325,672,451,929,-232.98311050240454,-591,172,null,1228.9170301512327,1135.5783079060559,1366.8952842017568,1597.773144928989,1143.9590300143268,2037.5168207804224,2059,1477,2675,461.22685507101096,-351,1353]
["East Midlands","Nottingham",505.08961563250307,198.87713316818247,1291.5765029720765,359.8240731968221,165.79886156536108,997.05845283193207,188,54,444,-171.8240731968221,-792,137,null,900.69171183101912,751,1187.5750207974386,764.73469105961453,504.11734524276534,955.34857226895167,637,435,880,-127.73469105961453,-424,254,null,987.25346289832601,885,1308.8895421936968,1165.0035882303489,779.95817001113539,1428.3928398738899,1575,1296,2008,409.9964117696511,-54,1031]
["East Midlands","Nottinghamshire",496.5240029647706,399.30321662891492,685.88620803967206,467.54111174991351,315.18740425652788,733.06386277166689,197,135,356,-270.54111174991351,-536,-47,"*↓",1720.5326648083251,1585.6301111947012,1870.9684205469177,1934.1649392162333,1517.6108911166887,2336.6990840165508,1502,1232,2043,-432.16493921623328,-900,267,null,1362.9433322269047,1242.7662501983471,1491.2830903632778,1598.7435455575826,1248.656794197899,1921.3456145477005,2119,1778,2892,520.25645444241741,69,1360,"*↑"]
["East Midlands","Rutland",4.7928234313576707,2,11.82730995367821,5.9069705909020511,null,null,10,0,32,4.0930294090979489,-3,25,null,21.567705441109517,9,40.90290242286315,8.6782813475106924,null,null,19,3,46,10.321718652489308,-9,42,null,21.567705441109517,9,40.902874229127008,23.20924902863997,null,null,26,5,61,2.7907509713600298,-39,49]
["East of England","Bedfordshire \n(Bedford UA / Central Bedfordshire UA)",249.06818085263961,198.34745383847047,356.43465731372333,212.37014612669734,170.25423338054387,364.06056142801589,146,43,332,-66.370146126697335,-263,106,null,693.04897222446516,594.75919135435356,836.11876605912369,654.12567877365291,544.08082826577595,857.81843244106062,601,378,956,-53.125678773652908,-344,302,null,844.88284692289517,731.72097562222427,1013.7064652255635,667.50417509964973,557.93796105502179,891.506404029799,1082,685,1444,414.49582490035027,-39,786]
["East of England","Cambridgeshire",257.45996191946335,199.49137560586396,391.38292839390516,123.81014238843161,106.32188792227416,205.99978502156841,191,41,510,67.189857611568385,-128,371,null,823.0666797324451,730.32957329325404,974.73866561146531,599.68210303806734,532.61951846034719,694.3172420519569,593,290,984,-6.6821030380673392,-323,386,null,954.47335834809144,848.74553556950229,1113.9906092081312,963.50775457350096,864.92577764604323,1104.6157562006636,1170,815,1655,206.49224542649904,-167,686]
["East of England","Essex",444.39658401782339,247.38547368541785,717.08188657701294,310.89806814053952,180.56558268365757,530.70289024442354,504,109,1249,193.10193185946048,-143,865,null,1297.7770398398211,844,1801.7831442653594,1251.0090128867428,747.06404249696482,1829.2981720354273,998,525,1736,-253.00901288674277,-1032,689,null,2089.2383864691774,1221.372826284075,2993.7304344164386,2149.2686941810298,1260.4967716368408,3019.3149933791724,2990,1706,4239,840.73130581897021,-875,2386]
["East of England","Hertfordshire",486.82667598568048,276.33518032633594,794.23418154162391,273.07320101157603,224.17439655631549,377.80609062317274,264,162,457,-9.0732010115760318,-159,192,null,1168.7493255164682,749,1650.6282033029197,939.82664864388653,806.1154324335979,1114.848720454298,958,753,1228,18.173351356113471,-250,319,null,1468.9292564314239,948,2044.3902033178178,1601.1001503445375,1423.905254632027,1874.5100635504607,2196,1825,2709,594.8998496554625,143,1122,"*↑"]
["East of England","Luton",261.33552024498618,206.95891394180401,385.79824607003513,244.60010623179562,160.77153599618626,636.71315011313038,85,37,175,-159.60010623179562,-534,-56,"*↓",601.0942580381261,502.16817032488683,745.41860002734825,506.38761549237506,332.99477888604662,615.95868254137349,418,309,566,-88.387615492375062,-238,139,null,682.57022171688754,587.53366070983736,856.27080207970403,604.01227827582932,401.78426343749345,737.85402402003092,908,705,1105,303.98772172417068,61,590,"*↑"]
["East of England","Norfolk",326.52932284944228,242.68225587927523,413.99243488157163,218.50942212970412,165.76481856948254,285.10749534870098,221,148,381,2.4905778702958798,-97,161,null,1251.1028244431668,923,1587.7430836829715,1195.3059300812833,890.49689025047599,1505.545096110859,971,698,1407,-224.30593008128335,-638,314,null,2117.0610311617684,1582.5857671102051,2628.0134015602898,2050.2579474358135,1512.4930523809953,2569.0685816388918,2339,1838,2796,288.74205256418645,-415,993]
["East of England","Peterborough",208.56279726967259,164.38210001491743,322.68923958524221,114.45043316579317,97.542063528627992,274.07048415988226,81,38,167,-33.450433165793171,-188,48,null,589.97877235994611,515.70404257600308,664.32307968231919,453.33709313020006,374.57332368470327,509.57387523457504,479,355,625,25.66290686979994,-114,198,null,531.45843037038117,463.01333583280103,594.60081757701471,660.21247370400681,558.45680528665105,746.9975927487676,792,611,977,131.78752629599319,-61,343]
["East of England","Southend-on-Sea",98.513862615297924,82.464270818166426,222.43528757303625,152.55315498969563,120.057578659231,304.04214980417896,50,28,123,-102.55315498969563,-252,-36,"*↓",258.90245466503734,218,346.64589739410064,298.21036353773547,223.52752459709023,367.25225652759804,240,170,365,-58.210363537735475,-144,84,null,492.58368271966469,405.95899833170557,651.43873173345287,474.23648147256881,368.41891499072278,575.07457362655794,641,521,835,166.76351852743119,21,410,"*↑"]
["East of England","Suffolk",305.54921862018261,265.11424485910476,387.32182243748241,179.08556716164168,157.4043048962416,225.59263270997363,254,64,621,74.914432838358323,-133,434,null,674.1666659040053,617.60518830448825,771.72561024401409,900.00266735792684,773.07141817793661,1124.4596195518127,671,362,1082,-229.00266735792684,-627,204,null,1049.2841154758119,961.12066647126062,1194.168509074,1063.9117654804315,912.66638269608461,1281.5219097505815,1466,903,2071,402.08823451956846,-225,1020]
["East of England","Thurrock",72.078665913163888,57.930293402664212,130.45038293727018,58.350397290803244,29.57635156054722,227.19679091605323,47,10,114,-11.350397290803244,-150,31,null,85.09545461282282,78,110.71170466807378,180.37739709187161,78.470545747704705,289.19247306853663,146,65,256,-34.377397091871615,-176,125,null,201.82587947401331,151.84585320462131,253.26169434849137,163.21556462951858,59.624703413706818,225.85561897762977,325,210,535,161.78443537048142,38,423,"*↑"]
["London","Barking and Dagenham",108.39595296597805,91.162853026786678,153.56301753851824,187.30020052804753,106.195975733461,419.62832449740392,82,53,157,-105.30020052804753,-342,-1,"*↓",341.46908517221419,288.83321380218405,410.55630175971612,271.44057013556505,162.64977793659415,372.40408141826202,333,263,451,61.559429864434946,-57,224,null,370.13496186180765,313.55658886475203,443.2688454481206,299.25922933638742,177.40357832192947,410.58141891066305,446,370,574,146.74077066361258,20,318,"*↑"]
["London","Barnet",122.77508043389606,83.270921779739794,303.02514136448718,179.38362888703421,121.12491150243628,369.78420472746615,112,32,291,-67.383628887034206,-292,98,null,273.42090314845478,218.06047122240031,331.53833918044108,246.5647021560539,188.39465470072057,341.43934605833766,327,210,550,80.435297843946103,-80,296,null,728.80401641764911,601.55962565142636,866.81841270395489,730.05166895691207,573.75375680470358,999.4906103298589,951,691,1299,220.94833104308793,-179,620]
["London","Bexley",98.199575631702416,73.24219076962747,247.70632354902258,40.593536317835117,31.993058383494436,120.77462798584249,71,16,188,30.406463682164883,-72,134,null,135.88005124294074,98,208.02636056425675,138.29189005606111,95.137942332258945,188.44483375791074,198,88,336,59.708109943938894,-62,215,null,392.92037312535683,286.89290048848449,587.36173024673337,266.11457362610372,195.8594696233059,354.5115777923852,272,174,457,5.88542637389628,-129,206]
["London","Brent",218.63107975309151,144.23225624375144,344.43631266675186,330.32047448326239,241.44247650008239,484.89934238215426,185,94,351,-145.32047448326239,-338,42,null,441.02836366158738,320.55936078528276,571.47870164945914,345.3947725148239,245.31011174750429,440.5499820771638,365,227,541,19.605227485176101,-148,231,null,657.42978790424456,524,835.47067603976984,686.44436566476588,492.28654613288273,878.44385951097581,860,599,1141,173.55563433523412,-168,493]
["London","Bromley",148.56574210823766,54.21726371810054,540.70694252691771,111.72401686970827,68.356967540987668,271.81724940576714,87,34,341,-24.724016869708265,-190,199,null,222.7593324980198,165,341.89037963718317,160.56072827483428,114.21948805962838,211.58976954813915,167,90,283,6.4392717251657245,-93,129,null,456.54738965690012,311,666.91512270224825,541.71525485545749,385.67007780188487,674.55907952765551,616,387,854,74.284745144542512,-184,375]
["London","Camden",93.240158379609326,63.951070142937674,191.95661817506911,77.927097009996658,66.643518899243801,138.19351264132237,202,88,441,124.07290299000334,-13,358,null,654.68272818473122,466.33171442199688,893.84788051359953,526.83785361425601,449.90127420600476,644.97830122611219,419,263,645,-107.83785361425601,-302,134,null,1215.6778146693423,985,1462.9935904229917,1450.2350493757474,1267.7565202191604,1705.0574103153515,1097,802,1365,-353.23504937574739,-729,-36,"*↓"]
["London","City of London",3.0292162499287643,null,null,1.4013641708701527,null,null,3,1,7,1.5986358291298473,0,5,null,16.660689374608204,null,null,8.7977433152937348,null,null,9,3,17,0.20225668470626523,-8,8,null,15.146081249643821,null,null,15.676407441075074,null,null,11,4,19,-4.6764074410750744,-13,6]
["London","Croydon",265.05609394872653,174.77530127449299,414.37598335650074,166.12983776813891,106.72394402595621,273.31768876212044,116,44,292,-50.129837768138913,-153,99,null,460.2238047995578,318.09411854142826,641.79208958368724,400.02993767271454,258.09398963490128,586.29657645800012,365,249,581,-35.029937672714539,-278,207,null,582.01885506134727,474,758.35645031595129,903.55055739977024,624.84875876659578,1164.2474106444697,1005,750,1265,101.44944260022976,-312,507]
["London","Ealing",335.26781526545369,256.4881941398944,437.05103800012949,390.78212066619602,304.58580779742761,534.87096376688714,138,66,276,-252.78212066619602,-429,-100,"*↓",772.69125372064491,630,909.35497955192125,811.58539644154041,691.463149318815,957.61283152684086,688,491,959,-123.58539644154041,-369,163,null,952.46472632711948,762.09839979316337,1143.8785044643557,1033.6324828922636,892.17900976158865,1202.0907168119547,1203,885,1502,169.36751710773638,-195,517]
["London","Enfield",249.58870255650061,180.71178443482199,451.60566566642228,197.00821354536183,154.87009131699224,295.45615952310982,332,143,815,134.99178645463817,-100,609,null,462.5814665729643,367.23156766432987,623.03044568071232,413.26986419976834,321.32385587504615,519.1330942754272,352,205,567,-61.269864199768335,-246,175,null,647.82983087053503,514.9502900609607,877.1986388204482,732.72192225486981,599.00852237005859,869.58091329689728,684,418,1108,-48.72192225486981,-343,396]
["London","Greenwich",205.0042437949532,163.36421050981028,327.31318171591488,86.891913976755717,67.36648175577956,174.15697422020423,70,29,156,-16.891913976755717,-124,64,null,495.73152504255728,390.01045789503951,703.60452678697732,397.31573701998991,289.2506121749081,533.13526351059704,308,180,474,-89.315737019989911,-282,105,null,913.26423116248941,749.71657452629961,1279.7281213768545,979.79234900325446,802.1505636506231,1197.2296162498471,733,507,968,-246.79234900325446,-534,64]
["London","Hackney",369.20068508672301,231.56965658037257,719.69344621982168,363.75615904848001,290.99416108467022,480.73861851596348,103,69,201,-260.75615904848001,-355,-183,"*↓",620.63040719539742,425.48477906306545,806.55517143123666,577.53780012527477,467.27765380769381,682.42139837624313,479,277,712,-98.537800125274771,-314,164,null,802.50724138711314,754,982.51659293770649,1043.2130742601817,850.02420390654652,1197.0533007262013,1407,1085,1709,363.78692573981834,-16,747]
["London","Hammersmith and Fulham",107.55270895783435,66.745894600930768,205.84480775474762,51.801390989162911,39.345618981026512,106.28451713659869,116,38,387,64.198609010837089,-37,324,null,191.51480469861559,138,248.06159198724276,370.05392152005174,267.40643423389122,521.21801333927863,160,95,264,-210.05392152005174,-372,-63,"*↓",921.68313653932432,738.31059486940592,1088.6554697228605,719.01213972888263,539.42603554541222,871.43938519689186,902,638,1113,182.98786027111737,-127,459]
["London","Haringey",268.51958973929101,200.93761478668259,393.3849857724652,190.73347880250813,128.52513642889025,286.65428675832851,84,40,196,-106.73347880250813,-191,-13,"*↓",386.79814491479397,305,473.82868882778882,628.03504175079888,460.94159997480352,847.65672869552691,372,193,593,-256.03504175079888,-562,16,null,752.03260237042502,585.82699518839854,914.68282051061931,581.39359913511794,412.7144746053541,730.28298751465127,950,647,1237,368.60640086488206,28,716,"*↑"]
["London","Harrow",157.07767746290011,98.445614585437454,284.32859886341146,68.594149205056496,40.269928720208526,180.55230524676804,90,32,220,21.405850794943504,-77,126,null,254.40508388878942,181,342.48441079361334,279.32043349304001,142.70695342909349,388.75950189541521,404,263,685,124.67956650695999,-67,463,null,291.71352851110299,211,419.42889342798014,389.04910547055795,228.91310130856755,567.77407794179817,508,349,831,118.95089452944205,-139,492]
["London","Havering",98.638111896539542,70.617078765871668,218.51105332871296,114.50079129947152,92.583764290096667,393.86432882093942,116,43,416,1.4992087005284844,-271,264,null,217.35149939048642,150.08942869213632,271.56614362686821,170.2576454150649,111.61453711698161,343.34931839272889,119,66,226,-51.2576454150649,-236,68,null,304.01038871297396,219.88901344707665,382.08451723688165,427.24156328546366,280.1805854919001,815.17541161670545,511,304,867,83.758436714536344,-337,474]
["London","Hillingdon",155.77501658940869,125.38005391764156,234.23853394702078,62.577532679042292,38.504766258188127,96.561539980625284,272,85,696,209.42246732095771,23,631,"*↑",668.15736347908944,534.30705640155998,890.44676466028,304.88291951424833,182.06721324032358,413.96740319859197,323,171,470,18.117080485751671,-160,217,null,472.06761993150184,385.8707339202428,652.25180807014146,682.29657052335563,470.439061860111,911.75365497324162,749,408,1032,66.703429476644374,-357,395]
["London","Hounslow",182.01831621423352,141.84391741781843,233.12898419055415,129.34374642741207,108.6615326936283,176.09890509587055,130,75,239,0.6562535725879286,-74,107,null,561.1268315003025,441.06163148272287,680.63311388401144,531.25016992959877,457.86411709222568,638.48002136928505,476,281,642,-55.250169929598769,-282,126,null,610.03160570982539,476.67660801379947,741.91583895124859,479.40608364298919,411.54743782366342,579.49960793316632,674,476,899,194.59391635701081,-30,434]
["London","Islington",150.59648727522418,112.55551110589408,217.74772828162943,151.32812952245018,111.60389163616358,270.94263519310897,99,52,276,-52.328129522450183,-180,112,null,535.74902155956045,367.99428127500005,741.28072160191323,464.62820385196972,350.7037158697882,590.93559640249055,289,142,454,-175.62820385196972,-387,22,null,1224.7137865063244,977,1455.4903403263827,1314.7352884172017,1083.1891822137204,1509.394068535807,1361,1074,1628,46.264711582798327,-281,410]
["London","Kensington and Chelsea",45.194523431395105,37.296392487810301,74.587935580237001,33.750133161497331,null,null,20,8,142,-13.750133161497331,-28,108,null,294.11249834977662,236.23089166402198,381.56240138267475,154.6881120754895,null,null,138,66,252,-16.688112075489499,-97,104,null,826.69297821882833,711.51805762148501,1021.0446906054757,620.15870351343824,null,null,636,427,797,15.84129648656176,-243,228]
["London","Kingston upon Thames",27.059655740970737,25,48.651229584687592,39.195485651765104,34.757842804002308,108.29535974503983,43,16,161,3.8045143482348962,-70,115,null,140.7940314173002,114,250.79748783841782,141.95646954124206,108.4794735333044,202.02122851714807,156,97,286,14.043530458757942,-70,136,null,274.14631284172907,201.24255063678697,460.74342821689567,257.84804480699285,193.94544768843588,346.09455157674489,251,155,408,-6.8480448069928457,-132,175]
["London","Lambeth",127.04839526005885,100.89178073841981,172.24934677111136,151.13142432424794,97.095274763910524,285.89572487439921,68,45,168,-83.131424324247945,-208,14,null,614.10665025578749,503.20674303702555,740.94739044162009,779.4178044389979,537.82864546871008,1113.7044733382847,437,286,640,-342.4178044389979,-701,-27,"*↓",1346.7685807150297,1095.4551052411953,1572.3501886839326,1359.5646324987013,967.18120180086908,1705.7905387934352,1313,985,1630,-46.564632498701258,-541,444]
["London","Lewisham",210.85469349799888,110.3990738179622,493.85428007300402,315.44611810309954,216.76262244152315,521.14553251848929,114,61,239,-201.44611810309954,-396,-81,"*↓",415.80277226979803,289,573.03139669436268,462.41297472545307,355.72404492381793,571.99585300743331,313,145,516,-149.41297472545307,-356,87,null,1044.2463171545837,781,1281.2581862682225,1097.2003649828771,842.18444777756781,1308.5962582028794,1059,734,1385,-38.20036498287709,-469,386]
["London","Merton",89.582922822681255,66.439305965957359,224.91911809719224,80.107629315341569,59.740495517345032,166.99308049619813,38,7,130,-42.107629315341569,-141,38,null,176.23469995568743,128.95744716066238,233.376798284194,211.76487687840552,162.6832047003339,351.01426504299366,141,53,332,-70.764876878405516,-244,122,null,374.18237722163127,276.58979584023587,459.38406303608656,302.12749380625297,228.19003781685475,467.47193629057983,313,117,501,10.872506193747029,-249,207]
["London","Newham",595.40940675598836,391.59929601376922,880.80381337946312,604.34173880152684,488.88097033197181,846.70613793204336,162,109,257,-442.34173880152684,-686,-288,"*↓",711.98593262844099,576,864.42357254899946,1020.1744051427761,844.18088153215479,1254.7968527355454,854,630,1146,-166.1744051427761,-494,167,null,787.69140844408605,609.02310811383052,979.98911765224022,841.48385605569729,703.04676575855285,1027.2613795250784,861,631,1109,19.516143944302712,-274,302]
["London","Redbridge",214.94178818484372,167.75238400020046,337.76257622295003,251.63540868898011,169.69891910599404,509.08358739099953,90,32,200,-161.63540868898011,-448,-34,"*↓",359.03427997976172,283.22426212619968,432.08827181432252,486.47457045802491,366.62691025524657,726.84389020197659,346,194,537,-140.47457045802491,-428,78,null,443.02393183539465,357.06165932379071,524.85981094597742,569.89002085299501,420.39100949566483,856.27221012526013,459,273,670,-110.89002085299501,-455,128]
["London","Richmond upon Thames",32.336028533761301,25.014344586710326,80.04912480091572,29.266801335587022,21.270374018449452,84.653754951895507,52,11,137,22.733198664412978,-55,98,null,142.69340398184232,106.76392983579606,208.22295425291199,166.08816857596216,115.61102710981562,293.89712379877528,177,89,387,10.911831424037842,-151,208,null,328.97056748439644,263.51030436848311,434.08927871900715,324.64503008845077,238.87536437125644,541.76842580572645,399,252,665,74.354969911549233,-183,317]
["London","Southwark",382.2377096878821,253.78918963077521,630.04450885032577,234.06454925137976,171.77431016089179,371.05557022542678,144,69,418,-90.064549251379759,-261,201,null,398.54767157282629,308.65969452456125,498.96875274745912,551.91583408365875,450.18421109301147,674.75965245717214,341,150,573,-210.91583408365875,-448,46,null,1272.1847471528142,1004.6834165016697,1510.9035265360853,1453.4610235198977,1185.2501674842081,1688.2789146603347,1306,960,1645,-147.46102351989771,-528,292]
["London","Sutton",70.299176928290649,54.048136589306914,124.1214790817542,100.53263826718472,80.276203366596107,386.6172791728618,69,16,188,-31.532638267184723,-340,55,null,231.80457234469293,166.12862144060202,315.25637635093523,219.28717199409471,131.13816060229905,307.60450243162666,215,93,389,-4.287171994094706,-158,207,null,430.89625072701648,352.2409652452622,565.05102061772595,350.18018973872051,199.93632301394291,486.75963578803851,452,261,697,101.81981026127949,-105,400]
["London","Tower Hamlets",424.17054016072484,244.53314028111203,729.89819622923346,292.17288827085446,241.05371618003451,426.85493345337972,120,55,254,-172.17288827085446,-298,-64,"*↓",949.67874977025747,787,1106.5245001984767,1340.9998387839937,1115.1493197934265,1548.0870337647186,697,438,932,-643.99983878399371,-993,-317,"*↓",1265.1431699819614,1036.719666972165,1453.3886644094014,1413.5176213391342,1175.1379372541112,1623.6028034985691,1492,1152,1856,78.482378660865834,-374,525]
["London","Waltham Forest",210.79541232857758,148.85631145228558,300.22984437782537,250.08026255836319,161.6849734810001,433.27163433024947,180,111,351,-70.080262558363188,-257,112,null,330.45435432067939,243,415.62569976499759,402.28040678371536,274.39272633456432,542.98742965025065,448,317,631,45.719593216284636,-146,255,null,470.02224189634421,339,588.68499870549715,496.88017931631123,339.55680253793895,651.44676116253129,702,544,965,205.11982068368877,-6,515]
["London","Wandsworth",152.02392252628152,108.76493228474264,241.99664793198681,103.00074202292453,50.327423573040328,431.01106999451486,90,27,219,-13.000742022924527,-352,106,null,337.69825047847087,238.48775782054645,434.00984683487803,329.55932492294539,187.48009680884689,470.03607439637841,237,134,415,-92.559324922945393,-277,151,null,800.3871699180072,564.51120779380449,1005.859367370779,829.42257562472901,508.56711671039824,1081.9621312062422,813,504,1121,-16.422575624729006,-467,504]
["London","Westminster",80.617532508814548,64.556517432991583,118.3813009078472,86.124066333024757,68.682527547604209,343.69848110211638,55,18,138,-31.124066333024757,-302,34,null,584.75477797373048,472.0666640272737,735.57020967315395,546.24606082610239,425.38506131808975,736.39404284073748,333,238,485,-213.24606082610239,-428,-13,"*↓",1212.3697737493626,985.37307327316068,1415.4912416848354,1393.6298728408731,1144.9541023426837,1746.2924166818723,1115,882,1352,-278.62987284087308,-699,81]
["North East","County Durham",303.37652775777417,224.68079668770278,540.57563581516058,212.73516301266176,177.82876925561931,367.94247147421845,179,64,397,-33.735163012661758,-234,159,null,1177.2559300204853,1030.8656837264434,1382.2943704188397,1012.8956226719399,892.74866880543823,1107.9512125814279,826,568,1105,-186.89562267193992,-451,127,null,705.36754222174034,608.17379213286551,850.27344276526571,766.36921431539838,677.36530561665859,859.99716707014886,996,698,1322,229.63078568460162,-80,581]
["North East","Darlington",65.08594219721364,52.866394441550277,124.60290234627756,53.021640195036788,46.475123851742353,124.69202533404204,31,21,74,-22.021640195036788,-94,16,null,348.88716791750625,285.71988729424152,396.85263168186867,295.8615229781023,249.82214803084585,350.75116843003843,200,154,279,-95.8615229781023,-171,0,null,341.45765607569359,282.11435332751972,393.04375432804034,286.11683682686089,242.42905358554538,349.02289226959107,425,355,562,138.88316317313911,40,282,"*↑"]
["North East","Gateshead",217.20323946530519,190.69490161537931,266.74689796628297,225.02000194931713,199.34287120739549,270.12813495543475,152,83,335,-73.020001949317134,-158,104,null,763.69145357413709,694.94066955802134,847.44133401223223,819.80527955510797,739.70803534027914,913.78877672325189,677,517,874,-142.80527955510797,-336,55,null,475.1053069605577,430.40404301702489,548.72349139568689,611.17471849557501,548.16555846280266,688.53348779074713,786,591,993,174.82528150442499,-43,390]
["North East","Hartlepool",69.061263484444893,58.901570483040615,107.34855860162972,55.40919939050405,48.263005521497163,233.42845465220125,26,20,55,-29.40919939050405,-208,-11,"*↓",501.89663795932842,430,606.51841954580493,459.56763750427177,358.02147794691797,495.85583422331587,243,209,321,-216.56763750427177,-259,-87,"*↓",472.04209855622668,412.98653486346024,582.07976973718928,388.02316310522411,315.89147305510204,422.77146133856655,649,571,798,260.97683689477589,178,444,"*↑"]
["North East","Middlesbrough",232.52381020231351,201.29573664617516,291.25620164822317,133.34106674928239,117.58004156909519,182.06329473170553,105,75,182,-28.34106674928239,-88,46,null,1114.7122671383911,1004.9843061075508,1288.3743246354425,812.38014218284502,737.68679706296632,899.90631774957637,647,538,761,-165.38014218284502,-295,-30,"*↓",700.7639226592953,619.64188018448363,814.15492042256437,750.2787910678727,689.60757764532661,849.12953677477162,1184,1041,1313,433.7212089321273,259,563,"*↑"]
["North East","Newcastle upon Tyne",341.68975815392088,218.48022521054764,595.14306455272879,284.3439461740308,213.48842043897724,474.12460587657586,162,50,359,-122.3439461740308,-307,48,null,1087.2481204447872,806.31040394324577,1398.468163460265,795.99807819549289,649.35793532766024,931.45680390576797,638,445,882,-157.99807819549289,-431,172,null,564.43169409533505,389,721.60713370363953,940.78448131110338,761.12161360849404,1104.3657725676787,983,712,1274,42.215518688896623,-302,413]
["North East","North Tyneside",113.26564076539005,90.895290033364603,162.92880896036061,120.68213886875303,91.262077931562601,350.02492082552584,44,30,97,-76.682138868753029,-301,-32,"*↓",476.50911665178177,393.22815707706343,586.31967750659965,437.95457964692628,304.27578712585267,557.59727695920037,375,249,652,-62.954579646926277,-228,250,null,371.22524258282817,305.4603832306446,467.44864235821586,361.36328148432062,262.4375038454989,483.58173648296065,515,401,921,153.63671851567938,6,589,"*↑"]
["North East","Northumberland",164.63089515343088,143.20318671883942,203.00491646318707,148.04908364212415,119.80355789185313,207.99887269671783,106,71,215,-42.049083642124145,-112,72,null,509.92497077401379,445.47771650586515,592.51666678851711,653.36843407497611,538.26701969588373,863.18478313252297,387,314,520,-266.36843407497611,-474,-88,"*↓",532.44413407255524,477.07839428448881,640.74231984648316,476.58248228289983,387.02056496703665,625.77744337226579,599,505,782,122.41751771710017,-34,332]
["North East","Redcar and Cleveland",157.82193428811078,98.769452410581508,538.69222102131459,98.362088744313652,76.875882264403259,169.01980007305954,110,60,247,11.637911255686348,-76,141,null,412.72402256413739,356,543.1840762172003,429.73990376593343,358.21306074245513,501.39357628703613,415,309,594,-14.739903765933434,-131,190,null,369.45404314775192,280,494.63577430806896,394.89800748975296,338.353284611633,468.64483117039799,428,330,587,33.101992510247044,-92,205]
["North East","South Tyneside",105.20920575512217,89.07423219033231,136.98206047387768,47.392511407064937,28.400175819970386,76.613873617236095,48,18,103,-12,-42,58,null,307.41780922224837,262.34972342975965,362.81325354410751,204.16550030814838,117.74248575784429,263.88503364161357,224,159,291,-29,-69,124,null,332.37298502262951,284.34648675879436,391.35625849550138,350.44198828478665,281.53561518724626,465.93850409650202,316,252,415,27,-169,86]
["North East","Stockton-On-Tees",234.04576026649949,150.34220263636266,475.61154341874823,141.69695006999603,112.11375335125796,457.79066173174698,92,57,187,-49.696950069996035,-368,37,null,1083.5977660733843,888.86766654495784,1325.3086120428079,835.192216893058,640.38973771719225,919.29962597176791,802,667,1012,-33.192216893058003,-176,242,null,572.35647366011631,455.11888738026892,720.12213290612021,586.11083303694602,452.64479638761514,661.37370067723168,763,620,931,176.88916696305398,32,406,"*↑"]
["North East","Sunderland",233.40683705767927,193.04887909759211,427.54887191461091,128.87111742818328,109.98181809660815,212.87909165456821,97,28,229,-31.871117428183283,-147,88,null,549.7426539115761,501,608.65349792935353,535.14777660002426,466.50628489693082,635.0077617727294,511,311,722,-24.147776600024258,-252,206,null,446.85050903074466,361,513.67921163855169,422.98110597179249,374.50137839741745,517.59682617068904,673,435,939,250.01889402820751,-11,511]
["North West","Blackburn with Darwen",130.32518030708698,101.94381380323699,456.00140280655376,74.318914225571163,58.936567864585847,132.03976296897204,51,22,123,-23.318914225571163,-91,42,null,413.34562776637154,320,460.4092922030112,642.49215903757931,513.13642541469835,923.68793609568229,284,200,384,-358.49215903757931,-643,-197,"*↓",657.32919192654163,552,727.86841172509332,692.18892673684945,533.11146301133658,976.38730008302275,875,727,1027,182.81107326315055,-123,397]
["North West","Blackpool",144.16116787192905,92.747857890936302,384.48076835043832,111.64007477626919,84.105023570037588,219.00546651674989,43,27,95,-68.640074776269188,-176,-16,"*↓",740.5722494849648,576.38939450592011,923.34408360455609,484.43092964554774,383.19631160215636,613.33896191358554,348,262,435,-136.43092964554774,-281,2,null,916.92348708552413,880,1054.6901323821262,1085.6307189477313,906.13571373652621,1224.3081450686313,1168,1017,1314,82.369281052268661,-136,304]
["North West","Bolton",216.76977822589276,179.99763106890427,298.25856927245371,224.10492948865434,158.3650057159044,418.13229494617127,115,40,256,-109.10492948865434,-287,20,null,716.30363614165128,611.260470275084,831.16558964105673,566.60462398047912,454.2934147395726,672.82072311712773,652,488,923,85.395376019520882,-129,398,null,1068.2442645919032,908.83919440321267,1220.4495775635642,1084.0566034245433,877.95722011006058,1271.4918192895068,1779,1460,2256,694.94339657545675,300,1273,"*↑"]
["North West","Bury",56.988777291112527,47.184625380409614,154.07034736796862,75.579246256570713,49.722424815725702,333.80238828630155,51,10,125,-24.579246256570713,-269,22,null,223.93543651605944,186.49729609467838,261.72756159149469,230.32160337413703,131.79179596564856,294.91861286310956,180,137,249,-50.321603374137027,-139,73,null,550.07578619282799,469.40656163148759,626.23323767777686,459.39574772173336,254.49459096744351,556.52256680604557,504,415,613,44.604252278266642,-110,293]
["North West","Cheshire \n(Cheshire West, Cheshire East and Cheshire UA)",253.96621784561299,191.17524309209051,543.82347185537515,113.07586421225056,76.372033283998704,183.68544199814468,178,59,736,64.924135787749435,-81,618,null,1056.3251442260525,926.79033620020584,1180.4031641627537,788.88741671333059,512.78345260518415,1053.3070582883361,747,390,1163,-41.887416713330595,-501,454,null,1663.7086379283346,1459.7678461906819,1844.3371250361158,1706.7895564168227,1191.3207048479383,2197.6865066270852,1960,1294,2592,253.21044358317727,-583,1079]
["North West","Cumbria",231.96326354190384,176.44051542678687,301.75221419084318,222.90594635585282,196.65794508581664,278.23552522566342,114,71,233,-108.90594635585282,-180,5,null,1020.9317958157238,787.57050406112967,1239.014161208278,867.02980115714888,774.55118574828407,967.92525873685918,642,496,843,-225.02980115714888,-401,-2,"*↓",1091.2595184818567,837.82870532073014,1332.5517381777347,1271.0642524869979,1148.126645626892,1409.4306878411248,1931,1675,2412,659.93574751300207,363,1141,"*↑"]
["North West","Halton",47.236122949369722,35.646558592991099,111.40262689219128,23.329091460669641,17.946795862950172,224.78433304729941,13,8,39,-10.329091460669641,-210,3,null,205.71673028786847,170.2922580417117,264.31289703423721,156.34857729338106,97.76996785383254,231.17560160461315,132,89,249,-24.348577293381055,-106,102,null,446.04714676276188,378.54495211043695,546.02719263834081,441.32233124594939,263.17709977416666,523.80363935612252,502,360,842,60.677668754050615,-93,439]
["North West","Knowsley",130.01713918014502,82.620416636052838,727.89605264598572,37.36682006864023,24.057552432463261,184.58011625103063,42,16,192,4.6331799313597699,-140,145,null,210.5890442194202,136.64731349912023,462.8474295176764,107.34300485297904,67.485311825461139,176.29411846279254,101,62,194,-6.3430048529790355,-89,90,null,887.39381660043477,606,1879.063659822365,681.78876004091751,493.9290875120916,786.05640671279173,806,605,937,124.21123995908249,-100,363]
["North West","Lancashire",391.2120460772386,298.90659904367118,529.76046679912815,239.51395487342907,177.39202883292145,350.23059659742393,353,78,980,113.48604512657093,-157,680,null,2032.6484539229114,1581.4075160070997,2483.7999169604896,1772.5488296227056,1305.8640753412571,2300.6875343406359,1331,918,1917,-441.54882962270563,-1149,305,null,3430.5367329650394,2656.390614749384,4155.9657177541976,3737.3858741644644,2904.9925938792103,4699.090530180245,4206,3064,5200,468.61412583553556,-1227,1914]
["North West","Liverpool",505.93669803438138,314.22021818118338,860.99542085800874,371.76197920054113,217.36788303647074,719.34446824326153,189,86,450,-182.76197920054113,-482,92,null,1113.0395730358368,876.6050488187808,1428.6636850150876,1056.4383327404767,805.3366352544034,1382.1299962387006,610,362,908,-446.43833274047665,-875,-36,"*↓",3283.68073898803,2995,3713.4810649255505,3425.5033799604803,2885.156423882248,3896.5007280563386,3795,3178,4367,369.49662003951971,-515,1210]
["North West","Manchester",315.53510345663301,243.44862188882922,450.52362348764098,271.76992460580612,201.42651898532901,456.07058698617504,206,54,512,-65.769924605806125,-304,189,null,983.50271584751817,803.97327086327027,1180.2594902707135,1183.0856689471773,854.30431864763364,1634.3080215170105,569,425,739,-614.08566894717728,-1070,-218,"*↓",3023.659425832941,2516.2590188054864,3478.1040484578893,2774.2409295756597,2225.1672770664509,3284.0071472036484,2979,2388,3536,204.75907042434028,-647,1083]
["North West","Oldham",154.9417100509537,115.24551455815242,256.44683626798684,42.526125813136012,29.708185199458505,98.353666250633623,59,13,159,16.473874186863988,-54,103,null,435.61682974449366,333.56663890579773,574.85162178308826,271.10260665832345,186.44527046703075,340.72889604039028,276,187,450,4.8973933416765476,-117,202,null,607.94202713925131,606,729.19567898585558,812.27066087110381,618.84155655989036,988.79503538636038,980,807,1425,167.72933912889619,-104,677]
["North West","Rochdale",77.085783571080583,54,137.76170805841141,71.652222945835945,45.69594504960623,191.8346780481441,47,29,153,1,-142,79,null,633.83616043672043,453.75726570723185,913.38305851940174,605.64932665324568,434.38756259313629,894.31103157945915,276,205,402,-33,-627,-115,"*↓",794.92841584314237,513,993.85872033128919,628.50146412870765,390.5065594830545,778.50952444405289,1089,922,1315,138,243,793,"*↑"]
["North West","Salford",90.604947910440615,74.878705656284495,165.04985607792131,92.864854977278341,75.993643446837552,360.7792595428341,54,9,150,-38.864854977278341,-311,38,null,428.82434052097977,336.09448171009348,528.03953502513787,333.38987067742971,259.97517845157068,388.78517506381081,243,164,344,-90.389870677429712,-187,40,null,898.46404138333969,714.49203409076574,1076.3390349268936,988.74527434529182,763.30980598164808,1102.8153509993099,910,684,1142,-78.745274345291818,-298,265]
["North West","Sefton",65.469256372014016,45.929032895838724,129.13355555039001,38.178646814310184,null,null,62,37,156,23.821353185689816,-2,115,null,248.07887964570611,227,325.11251940017172,288.46089159649728,null,null,238,166,388,-50.460891596497277,-140,102,null,1419.5230802844619,1159.7516723871252,1640.1037114670785,1381.5014276810139,null,null,1315,1140,1789,-66.501427681013865,-352,464]
["North West","St. Helens",47.794212513400154,42.53687153695423,77.64938262717898,62.211328935143186,52.408892555091974,147.48377351313945,57,34,116,-5.211328935143186,-90,43,null,299.57057181064124,273.70064418427393,338.44817501043462,323.95265979963756,274.60299608193031,392.25450428647088,206,159,286,-117.95265979963756,-193,-28,"*↓",652.63521567595876,606.93285306887412,710.46185872215074,767.83601126521933,652.67947568621014,887.3363185116059,875,757,1082,107.16398873478067,-50,355]
["North West","Stockport",95.016992714311542,75.379551740799116,342.88511951415188,28.543909175528995,25.08241530517645,63.113957695478753,53,23,292,24.456090824471005,-28,254,null,383.18238101914159,295.6455890252011,448.44740353285624,412.07823911049383,349.21192692984488,544.47663014451791,277,181,404,-135.07823911049383,-306,-5,"*↓",871.80062626654706,694.6727657586863,1021.3301480914795,681.37785171397718,562.06672754758915,817.54198119228658,913,689,1138,231.62214828602282,-22,491]
["North West","Tameside",132.56136412865311,100.90187498212555,317.98498186448467,76.88395159885107,49.01553957789119,395.88077998762475,49,20,227,-27.88395159885107,-341,133,null,458.46297338879361,377.23552332016192,549.99368501284903,452.97465458992184,294.56810204267458,654.20250745901001,318,238,434,-134.97465458992184,-335,56,null,739.97566248255328,611.88057350927659,876.15600101749817,763.94077689495077,511.83186410332826,933.35044067604463,831,668,942,67.059223105049227,-166,338]
["North West","Trafford",24.835820895522389,null,null,17.794263977086842,null,null,60,11,153,42.205736022913158,-3,128,null,141.09690721649486,94,null,111.21415086439298,null,null,148,49,277,36.785849135607023,-78,174,null,562.8865979381444,null,null,542.72505600328293,null,null,524,313,768,-18.72505600328293,-333,312]
["North West","Warrington",66.996347415377656,58.963588784694849,101.24571123912843,37.61267197974135,26.918757935449822,264.24437876428868,39,19,179,1.38732802025865,-220,135,null,246.80518088541683,214.38927732394748,286.22051202360609,232.4864267889067,148.40784512024322,307.18522383036344,130,85,186,-102.4864267889067,-188,-8,"*↓",463.19847169920547,410.88371417263232,522.69666551186185,461.90090123135195,302.81658408667283,566.42145744781783,633,490,742,171.09909876864805,5,367,"*↑"]
["North West","Wigan",136.86423257686764,123.01718208321391,164.42493691612901,148.39708575030306,115.09116265238754,325.63453564753843,100,29,241,-48.397085750303063,-237,80,null,599.11377438222246,555.93082864216694,659.45295812502013,579.44844593465928,460.92899077686127,774.22139511762646,490,317,717,-89.448445934659276,-361,174,null,886.02199304090993,827.55141906171048,973.09703168249325,1043.1544683150375,853.24066308603699,1389.7973478620149,1277,983,1585,233.84553168496245,-212,603]
["North West","Wirral",115.41094924506011,95.740463771579456,185.63079778603665,55.40285324614198,50.325091066796467,91.680974315746283,107,47,324,51.59714675385802,-24,258,null,497.62378466846286,442.20161678315048,572.30985965882849,437.15646217140653,382.35048853590263,528.35091621312938,297,212,439,-140.15646217140653,-266,0,null,2267.9652660864767,2105.2879429835416,2464.8389147477055,2300.440684582451,2114.7394642985628,2522.7627891304214,2258,1891,2587,-42.440684582451013,-494,334]
["South East","Bracknell Forest",59.396253894269826,41.601390226128736,146.09520694918083,30.594276321391281,13.554603561234668,154.66127129358966,28,3,68,-2.5942763213912805,-126,35,null,96.730152714730551,74,124.61498831923561,71.172220314813075,12.17197460710517,119.03417736938863,86,44,145,14.827779685186925,-44,102,null,103.87359339099963,66,149.84549644340427,71.233503363795663,17.679200237777469,166.79529040867945,122,75,212,50.766496636204337,-51,149]
["South East","Brighton and Hove",114.96694736997763,88.498520765997867,159.13969022756064,90.78092996017503,69.692816374443552,128.48196723173436,148,78,415,57.21907003982497,-27,323,null,447.09521049055161,394,546.61430048395016,401.96419564527457,304.10176327423341,521.02277331439393,556,355,999,154.03580435472543,-79,600,null,1322.0009283019665,1089.7296577682828,1568.8730726096783,1302.3385564035575,1053.1332787712395,1546.0377588334345,1394,1107,2414,91.661443596442496,-272,1133]
["South East","Buckinghamshire",158.66618779843546,132.69508103467743,212.24372551566591,148.94898692961326,123.54436650650035,204.57417445698292,132,27,338,-16.948986929613255,-147,182,null,607.56611454058236,516.3071900970408,732.96918063072462,574.271682613194,485.65621634131048,741.56533208031988,479,226,743,-95.271682613194002,-407,183,null,653.76769766098244,556.63700501789776,807.20161269727487,524.77933045719283,444.27929908010537,671.75199581084917,783,389,1210,258.22066954280717,-152,682]
["South East","East Sussex",159.9565268848813,109.72390200936215,261.67054074057808,131.14187847009038,109.50793841857423,226.685833125074,106,51,273,-25.141878470090376,-137,122,null,492.48330776860081,403,675.66095241706535,441.03670234563077,383.66931810160628,502.82056597655424,467,282,742,25.963297654369228,-165,305,null,1212.1089413717159,862.34905779877624,1574.2738384434676,1099.8214191842787,970.17823983148469,1226.1758036047545,1408,967,1832,308.17858081572126,-147,762]
["South East","Hampshire",577.86342440700321,331.61983461200987,890.98931610938985,411.4404134249375,251.26771233411671,623.63041982414336,308,67,776,-103.4404134249375,-292,220,null,1300.1800158118463,841,1831.2103592745943,1400.8180352431639,838.96732853452284,1977.5598134224699,1021,503,1603,-379.81803524316388,-1259,505,null,1662.1240860439668,1006.3370998136245,2294.0684439219067,1696.9414371553903,1045.3200841743171,2388.5655479618695,1499,963,2221,-197.9414371553903,-1222,925]
["South East","Isle of Wight",22.49438202247191,null,null,41.85012708070478,null,null,24,4,63,-17.85012708070478,-18,44,null,272.08648648648648,null,null,234.72863018472214,null,null,120,60,229,-114.72863018472214,-190,18,null,278.27027027027026,null,null,206.42124273457307,null,null,337,200,454,130.57875726542693,-63,208]
["South East","Kent",830.31639680200112,643.01527042149655,1174.1786965946078,519.25691270709683,328.73641333628012,771.23338607327594,685,306,1365,165.74308729290317,-280,892,null,1571.7459343887913,1394.2883309721274,1765.8659869138678,1305.1925165507482,823.82756833722374,1871.5653570339409,1406,585,2385,100.80748344925178,-923,1195,null,1887.9376688092082,1671.7267359550015,2114.9698671798969,2276.978704700618,1407.3770886143236,3170.1736215214141,2310,1202,3706,33.021295299382018,-1415,1612]
["South East","Medway",148.71256542319827,124.82043464568176,202.13823093038039,100.95333898036,71.437959577190668,229.58692952496389,107,36,266,6.0466610196399984,-118,139,null,511.1514284798838,446.68284183948543,576.65836703204889,591.00077018511615,401.78483728686786,770.6181023675565,392,223,607,-199.00077018511615,-476,100,null,612.13600609691787,535.87524478873479,701.47811646598018,560.00127143379609,365.08341038438465,712.32745415765646,709,490,994,148.99872856620391,-143,526]
["South East","Milton Keynes",68.463255026696785,53.593855587209781,118.78134958336609,81.934860344162573,55.633642711124885,128.40627182138971,70,19,195,-11.934860344162573,-67,83,null,450.93413199666918,341.47911212533216,624.7887539353469,324.60166264323345,207.84145329543327,438.27200863615843,332,163,550,7.3983373567665467,-206,273,null,326.60261297663402,235.22835971824503,456.67878395661666,398.17647633020221,257.26875944755147,530.14878677121249,444,240,709,45.823523669797794,-223,364]
["South East","Oxfordshire",368.22102262897744,213.07241561526493,659.96081811432725,451.33908686541548,274.56692673513362,813.91565147195729,259,63,675,-192.33908686541548,-519,183,null,1211.0532603888278,827.83558866277588,1584.5713474800491,989.27619326276749,678.75428775062858,1329.613471751044,987,551,1681,-2.2761932627674923,-603,856,null,930.32540124011155,768,1232.7356073400044,1091.4823301779359,731.87538516963343,1439.8071578491392,1565,1101,2466,473.51766982206414,-143,1549]
["South East","Portsmouth",74.953764353964473,65.613976326280621,103.3793667319802,154.13714049322533,122.81362785510818,229.65214752114471,70,39,199,-84.137140493225331,-165,28,null,431.119053204561,370.83258603938566,525.86163277269986,560.6121257694748,453.41120609623249,714.48288446057518,447,298,612,-113.6121257694748,-342,78,null,681.92718244147443,596.21375680488325,820.94232775494095,761.25073373730004,623.91106574867467,951.58897408417329,798,557,999,36.749266262699962,-273,262]
["South East","Reading",238.49834050764542,150.24212965686868,412.3488739496363,205.53451946211098,152.05347652913153,320.12705114780908,100,42,210,-105.53451946211098,-223,-9,"*↓",477.56625770176692,358.19754275935753,609.16773239145175,398.62273186581768,299.73801259020746,474.77401016706216,382,294,572,-16.622731865817684,-142,208,null,438.68103639278075,342,538.77092723309306,506.98065825018278,388.44674345470162,624.45031097726178,675,545,956,168.01934174981722,-14,497]
["South East","Slough",199.98669371211375,142.60130094690669,386.4133301489033,80.94079509169643,56.613876565831013,199.57539950603146,39,17,97,-41.94079509169643,-152,1,null,468.29196120215664,354.48874754163535,582.40383284054326,419.88664190779741,282.69841757242187,542.19026007052082,272,188,390,-147.88664190779741,-300,43,null,320.72134508572964,241.07506653246338,399.26647845926692,410.40737833694897,262.47665203394087,583.11028240043902,447,305,568,36.592621663051034,-188,245]
["South East","Southampton",188.41836224171001,119.71404744683348,389.6249478732114,82.428676018355546,54.319302874862565,120.40451593003928,96,30,226,13.571323981644454,-56,135,null,628.04606441601914,500.48554232283072,882.96941190196821,356.74858065273094,231.92103985112973,491.84949594542263,356,217,517,-0.74858065273093644,-211,204,null,688.53557334227105,547.65918899721237,923.719702459112,1002.2427971247354,785.36364941275008,1236.8509143072361,821,598,1084,-181.24279712473538,-539,189]
["South East","Surrey",294.2403797286014,242.31755444325989,386.1691002588999,289.61049084805416,253.03744433095468,362.70963512627907,291,51,727,1.3895091519458447,-266,431,null,866.41715991474314,718.60739633793798,1083.1419745944456,927.07836799685492,826.0428524600959,1066.3706697584748,814,359,1392,-113.07836799685492,-600,438,null,1440.3424603566552,1241.1686033440717,1797.4990895705182,1196.311141155091,1079.955892757446,1366.4979652598524,1304,793,1931,107.68885884490896,-448,750]
["South East","West Berkshire",70.103721094269162,57.499079230043563,98.964740858210476,70.230005890948405,51.487388060773512,162.52838855201091,9,6,13,-61.230005890948405,-154,-42,"*↓",218.24642652646429,179.32639307428317,271.64231705750149,196.48198218443795,139.45339473104346,277.74656752486783,197,138,289,0.51801781556204674,-94,109,null,200.64985237926658,161.78876992255294,253.48144795649844,265.28801192461361,188.26893014621641,353.48196323449775,282,214,386,16.711988075386387,-91,140]
["South East","West Sussex",139.33812497427405,111.2540317927153,188.35064682441896,181.23888819618898,86.684502889691032,359.10115176709405,239,50,626,57.761111803811019,-150,396,null,832.46541011405293,661.96495059330834,1105.3663473769468,448.36204593868484,212.7541737627192,695.6495886966743,495,243,899,46.637954061315156,-343,564,null,1152.196464911673,943.55517021848425,1506.8160840072328,1210.8803956005941,644.18234652061506,1804.1681109519075,1496,815,2247,285.11960439940594,-743,1309]
["South East","Windsor and Maidenhead",89.140304909437475,56.994691118435419,147.08865872983398,49.655294796940971,24.829879283531376,96.026134551080162,18,10,37,-31.655294796940971,-76,2,null,214.34165751054803,137,282.81518232086938,161.75201373283068,73.338110333141174,252.366562233114,136,82,245,-25.752013732830676,-127,127,null,148.50197992093848,92.978656112124682,213.70284339688513,220.59269147022835,146.75497135914409,389.90163752855477,294,214,477,73.407308529771655,-96,278]
["South East","Wokingham",53.763814456608941,36.440643150850832,174.22532311294231,14.623089007467012,null,null,12,4,49,-2.6230890074670121,-38,18,null,104.61062295467008,74,150.20367525769163,143.49127638330975,null,null,86,39,196,-57.491276383309753,-186,38,null,140.62556258872095,68,205.30123247028249,181.88563460922327,null,null,179,88,310,-2.8856346092232741,-96,166]
["South West","Bath and North East Somerset",97.599640646697893,71.069098310734091,233.41986840013109,70.66982678427145,54.502074492197586,246.66368610184196,23,13,52,-47.66982678427145,-226,-22,"*↓",321.78024512577213,235.8250768612078,416.19188210227793,284.81654206515606,216.57275406197118,522.23423031244624,442,283,810,157.18345793484394,-122,536,null,485.45500249154128,368,581.37300825477962,483.51363115057256,379.47799878575438,868.37232268452021,519,294,921,35.486368849427436,-410,425]
["South West","Bournemouth",105.9646263265369,95.877908687306572,174.40221365867319,118.53117397260451,85.834305109491169,459.42203366028576,83,37,185,-35.531173972604506,-351,53,null,632.25501447804106,565.723232866324,914.89706314621947,543.5144694520036,422.94473835889244,614.98074455546544,405,337,539,-138.5144694520036,-241,61,null,1092.7803591954219,979.39987284885808,1567.1499457334535,1026.9367174583094,798.52304110980128,1147.2426210007986,1022,898,1268,-4.9367174583094311,-193,375]
["South West","Bristol, City of",360.94554559602034,310.06080297566928,429.77624619440206,708.12131598406643,440.20394580513067,1256.151529100958,213,92,466,-495.12131598406643,-1006,-144,"*↓",1776.1980269672431,1527.1736508000758,2045.4728350045004,1618.1963991151274,1306.0366999340183,1923.4680297692796,1196,869,1559,-422.19639911512741,-888,93,null,2312.2579433498263,1999.6274085082823,2642.8325270457212,1912.4718925836278,1539.8406719918155,2235.7301327764885,2707,2222,3204,794.52810741637222,140,1446,"*↑"]
["South West","Cornwall (UA) and \nIsles of Scilly (UA)",172.34376551388348,148.38477385385505,230.4371097587842,111.84261953941594,100.36779047111544,152.9072689674411,176,106,354,64.157380460584065,-19,239,null,741.40400791209515,645.88679557603245,847.14371202479697,608.92599285577489,536.13485855111162,727.28439096155341,614,452,846,5.0740071442251065,-209,246,null,1197.2522265740211,1071.979188668909,1364.8910730102625,1030.2313876048092,927.04527275741782,1203.5602396683801,1303,1064,1619,272.76861239519076,-25,607]
["South West","Devon",218.22973613180554,190.16927904232054,271.76793744271703,137.35986553922913,121.81371375534201,185.70638129060239,209,41,511,71.640134460770867,-115,353,null,762.6737096551974,684.72338415616036,855.29916860193248,773.08748550778353,685.75353569222386,909.9188070506915,629,344,1033,-144.08748550778353,-480,257,null,1050.0965542129968,946.27082717737005,1195.5337423251806,1184.5526489529873,1068.9474324433754,1379.508489063845,1275,892,1719,90.447351047012717,-361,541]
["South West","Dorset",83.788651635545889,70.930765271714307,119.44159580749998,70.280320527074792,60.355512468555503,104.60016201615092,108,25,294,37.719679472925208,-61,216,null,543.6454014136815,471.80473901319158,630.29667902328686,427.68126009669783,352.28578161286788,516.47954402939752,384,211,681,-43.681260096697827,-233,255,null,706.56594695077285,617.00615795798228,810.12205492341889,783.03841937622747,679.3989784095462,915.63173867748208,897,653,1320,113.96158062377253,-161,554]
["South West","Gloucestershire",311.14015653069777,231.5011822789285,445.93588932072402,173.57534971211044,121.2564692524995,299.98755380827964,186,82,453,12.424650287889563,-153,265,null,1211.2578755806107,910.93663379766826,1513.3225048216198,1019.7402301444355,711.25930450337376,1345.8737441427384,645,420,928,-374.74023014443549,-786,43,null,1096.658713595358,866,1376.4126739516962,1096.7026759522528,750.10318311968808,1421.3358856203536,1587,1073,2072,490.29732404774722,-135,1054]
["South West","North Somerset",160.47795168664626,131.4416183783768,279.6335629050003,35.951415645915702,30.969469662351269,64.880405320826597,64,16,547,28.048584354084298,-28,499,null,322.02693193126186,265.46138250766194,409.71640841513533,330.9143943976693,282.40119939967627,413.36646507889867,226,125,437,-104.9143943976693,-248,102,null,628.49511638209185,534.29526952000572,786.79853932173069,540.13418995641507,473.07689290586012,661.29334033704936,853,506,1412,312.86581004358493,-58,890]
["South West","Plymouth",218.99089537171577,185.10106100390416,269.10525099093661,184.7176823189946,162.20734405059301,221.99957113961543,145,59,307,-39.717682318994605,-142,120,null,745.10594875603454,625.68650191424877,860.36919550378298,663.19576824751664,581.37059737972868,748.96519968512098,629,526,778,-34.195768247516639,-170,143,null,1196.9240739613099,1017.021464858852,1374.6654772578265,1215.0865494334889,1099.7903020658389,1355.4986374490809,1245,1071,1526,29.913450566511074,-192,340]
["South West","Poole",16.107418892995209,7,25.4864192618858,16.084634709843332,null,null,13,7,29,-3.084634709843332,-23,6,null,103.77435804746744,43,170.21878379582117,220.35194951846833,null,null,117,62,282,-103.35194951846833,-152,105,null,320.11822305953734,271.30493406680785,536.03379059165707,265.56341577168831,null,null,302,219,599,36.436584228311688,-133,309]
["South West","Somerset",200.34781212575351,177.3937342697746,239.83887996585855,168.41072029240075,146.77856913895357,209.30247375816879,118,76,255,-50.410720292400754,-112,94,null,697.42010998749242,624.5110513588894,803.28615417204094,605.87060887370319,534.48355481391559,685.09733970598757,492,396,639,-113.87060887370319,-242,60,null,849.23207788675404,771.501626419133,985.07197340732296,978.718670833896,876.90730889402801,1111.4567712582939,1037,875,1255,58.281329166104001,-137,316]
["South West","South Gloucestershire",28.629353320579298,14,42.541436728575889,120.99306379108853,64.659023331183704,408.64434162803997,84,19,230,-36.993063791088531,-283,77,null,487.04000631953011,261.80182155775628,705.20434087474678,307.13869157241993,126.68891436613126,428.19209380503059,312,154,508,4.8613084275800702,-207,297,null,304.10079637175767,205,520.42291306503103,339.96165837313794,159.83778475768648,540.09059587837316,492,273,752,152.03834162686206,-170,500]
["South West","Swindon",140.18877037907839,113.95590903099603,218.23217618298688,174.48851028243931,134.0801131430008,250.61251043550953,68,42,159,-106.48851028243931,-186,-8,"*↓",444.2217747195894,368.26440947536668,608.51769658465594,470.66130039684839,367.66174942829724,583.31547419022343,376,298,476,-94.661300396848389,-215,56,null,403.58945490133209,333.66109230807081,593.33166086865549,422.85018932071222,346.21720162421127,567.94548259114595,468,383,589,45.149810679287782,-121,183]
["South West","Torbay",39.302061666405507,37,45.246893589229408,31.105579908234695,26.844105119731452,39.645547574735581,66,22,458,34.894420091765305,-12,416,null,300.43666770128704,266.157356062286,353.17332823234005,248.95708546473838,212.72433962874345,299.27908840491176,202,89,312,-46.957085464738384,-164,66,null,548.26127063230751,489.77287648211274,631.08929148594041,490.93733462702681,437.02010183331271,585.68974546303468,472,211,674,-18.937334627026814,-281,187]
["South West","Wiltshire",118.97274862812955,93.99117450942741,192.97680129307483,76.205735401096689,62.11005802923092,110.56448905294275,131,20,325,54.794264598903311,-72,236,null,510.71430099405268,414.91498455981338,724.01319774111005,383.20020618426389,313.58404190631836,468.09939549101233,443,203,692,59.799793815736109,-206,326,null,567.31295037781774,461.29356595059761,789.23792751415829,606.59405841463945,516.98611685827927,734.28374515725545,567,367,941,-39.594058414639449,-271,345]
["West Midlands","Birmingham",965.42174458249008,741.94334735911013,1290.7898201573739,922.57166325038293,724.49766273098476,1224.9281302561137,523,177,1084,-399.57166325038293,-781,73,null,4088.8021136827274,3478.9663326313857,4751.4782365346646,4521.2790665374469,3858.8998489210303,5159.9857003367852,2600,1874,3488,-1921.2790665374469,-2942,-701,"*↓",4073.6919119566819,3456.9256941345407,4748.6473550109131,3964.2701037025163,3398.2983767110231,4540.7330725328566,5111,4018,6140,1146.7298962974837,-179,2430]
["West Midlands","Coventry",154.08557967629429,113,223.89510461369809,50.441800063687239,30.244852929754266,80.989934709506429,128,59,399,14,1,345,"*↑",907.3472502228384,659.37031145531796,1218.1411797346543,609.72121843743435,313.87555285811521,1026.979762583577,585,446,789,-16,-437,344,null,798.168396343891,649,1037.7473029780328,1037.4962274676457,663.92126077402031,1410.8094905476516,1092,876,1368,109,-371,531]
["West Midlands","Dudley",333.29748366995966,240.97353620499069,528.11840242334517,473.9865870028874,197.82986564647268,1083.1938476587945,76,51,151,-397.9865870028874,-990,-111,"*↓",920.1193928209932,763.99190332332557,1158.2053682998535,729.36699466023674,397.12208692686556,950.28943163261306,811,689,988,81.633005339763258,-172,450,null,507.58312350904708,412.04188457765804,632.40371661928339,604.64641833687585,334.28007563916913,786.67834592309657,708,588,857,103.35358166312415,-120,427]
["West Midlands","Herefordshire, County of",70.950323039317794,60.91636910486789,106.23497372705897,68.00304452931708,54.775934543642776,245.85462800999014,43,15,395,-25.00304452931708,-187,287,null,333.07231774207037,283.81786995514915,402.27957348792665,262.89002766672701,189.83978035485973,318.62068810353401,309,169,537,46.109972333272992,-90,299,null,362.97735921861175,318.14567269130077,440.79985338707894,353.1069278039559,258.3713387468552,416.33709410025369,478,277,762,124.8930721960441,-80,432]
["West Midlands","Sandwell",382.43957905405728,257.61697607380154,698.14123511263358,226.09485869344823,161.67856824857779,342.97583456564234,128,42,275,-98.094858693448231,-208,29,null,915.04074105440134,688.09858838759055,1103.4397203006083,1025.972743829826,785.80859267808273,1263.2452994233788,754,536,1048,-271.97274382982596,-611,147,null,555.29491624736761,417.93001958577668,686.08508467879665,643.0785100761359,470.32128987148013,853.93240774673154,925,618,1208,281.9214899238641,-129,632]
["West Midlands","Shropshire",117.7530502060965,105.03646699033867,145.30153367938127,77.176956250430848,67.912955726539224,137.6058502632809,110,40,249,32.823043749569152,-62,158,null,373.58907801807106,330.07942212609447,418.75853850854583,308.9272257431893,258.48566179542917,352.51621144505071,441,352,633,132.0727742568107,34,335,"*↑",474.65787177583235,427.92849516774248,536.00705696862349,415.89581800637995,366.57402601084209,480.9501584083788,560,460,796,144.10418199362005,24,383,"*↑"]
["West Midlands","Solihull",83.944773346738586,70.456852924810519,188.87102961451347,35.181874053337872,21.049024893101997,232.89285814375478,71,14,172,35.818125946662128,-148,134,null,407.67318730426246,337.77653921820945,484.80960235340751,341.44418284489228,234.2599349429353,417.25533827414091,335,216,526,-6.444182844892282,-146,208,null,240.38203934899903,195.41887256508377,293.01569382635716,265.37394310176984,180.23735671881676,329.12206683727152,530,377,763,264.62605689823016,97,511,"*↑"]
["West Midlands","Staffordshire",375.8728106687924,326.48081389044211,474.34119943235544,251.49431504816451,168.16844306598955,361.4486318045,195,130,343,-56.494315048164509,-190,125,null,1272.8713121653691,1162.0947140111039,1451.1277218926048,1232.2244743959234,830.24897140344035,1673.5467852780082,1022,891,1184,-210.22447439592338,-651,224,null,1130.2558771658387,1025.5326192004668,1295.159940417944,1380.5802411742106,909.84432242525963,1906.1064008907058,1462,1304,1653,81.419758825789359,-457,581]
["West Midlands","Stoke-on-Trent",175.15834486016328,162.81356281092502,195.42300628566511,225.82006554668479,176.10215784125023,647.96005841246676,119,53,267,-106.82006554668479,-564,38,null,930.45072171757101,873.5419287063437,1000.6242340431161,812.84841886681534,624.79407875756351,899.97725265915506,800,640,1007,-12.848418866815337,-194,260,null,951.39093342226545,898.41804061395612,1028.1409584017113,1029.3315155864998,791.78430420112329,1137.4606068798935,1591,1382,1944,561.66848441350021,338,995,"*↑"]
["West Midlands","Telford and Wrekin",84.972744212437334,61.186631060790134,156.45403654738325,35.805583819183205,26.97614268488687,133.12344270856909,44,27,131,8.1944161808167948,-91,80,null,322.97244201772554,232.0573742212743,412.76717360652401,304.75567957826991,204.42071348244147,409.99439328142165,250,190,342,-54.755679578269906,-174,83,null,502.55884479652218,386.70171452153966,610.17315010107552,344.21359511429824,228.37008814611698,437.68421471414143,471,383,634,126.78640488570176,6,323,"*↑"]
["West Midlands","Walsall",398.80668395704089,255.55761747520953,670.97322766850027,173.93763295062567,140.04815752095806,231.02121494506531,82,63,131,-91.93763295062567,-149,-35,"*↓",934.62052759896881,731.48473495269195,1100.1030054030732,1052.1762816781879,850.45671578219583,1240.8316973675965,798,688,980,-254.17628167818793,-454,6,null,555.07749313200679,431.93314945049485,661.60570831229813,801.25332176552149,655.53690637423256,971.0082923174657,747,638,891,-54.253321765521491,-254,159]
["West Midlands","Warwickshire",219.21143463083499,175.61055335022508,447.55008821342801,108.18770734701948,83.707285324565746,226.01603933880665,185,44,444,76.812292652980517,-118,319,null,967.80131675130042,795.82476334803857,1219.7159259066239,951.07002113088959,777.37827187038295,1178.1749648465354,663,364,1051,-288.07002113088959,-673,127,null,856.98724861786445,683.11542619440934,1044.5600527845436,650.74227152209096,492.49257695228528,824.93740695825932,1237,823,1711,586.25772847790904,147,1073,"*↑"]
["West Midlands","Wolverhampton",239.5767755080843,207.41205561670881,295.37333528885546,300.63301629800822,203.50804560925638,498.23074114378943,141,90,251,-159.63301629800822,-353,-10,"*↓",972.77048705810773,868.5079249896462,1132.5187932672736,1040.0474691228123,845.67546026908383,1215.4512527392828,698,545,922,-342.04746912281234,-567,-30,"*↓",799.65273743380783,713.5931210897653,945.17732161407264,646.31498500577493,524.13163603944213,773.246428838513,1065,869,1314,418.68501499422507,190,701,"*↑"]
["West Midlands","Worcestershire",194.59211253937153,147,259.3731797074629,161.44354309460726,136.01282656730052,222.34785749651692,100,58,202,-61.443543094607264,-137,52,null,1109.5887495778284,787.83777932343321,1457.5448292439944,990.8261505155582,817.46925149369758,1280.7312246083488,849,594,1117,-141.8261505155582,-528,145,null,984.30118516276332,702.30592605550953,1289.522781206636,1275.7303063898346,1090.7127774489491,1659.5357410866407,1433,1040,1813,157.2696936101654,-422,576]
["Yorkshire and the Humber","Barnsley",91.489298099462957,80.325281692440143,135.5763868059569,78.115589086294023,63.516474159071691,151.99033731225217,90,44,490,11.884410913705977,-80,390,null,726.02285457062339,632.36772670079438,848.59720853321812,714.67812062768178,603.88551593857323,849.1970722806733,586,421,781,-128.67812062768178,-342,91,null,573.48784732991362,501.782747747793,675.59606743436132,810.20629028602423,699.27100295204389,966.33934731929548,858,626,1090,47.793709713975773,-239,321]
["Yorkshire and the Humber","Bradford",655.6532737172987,421.04235951310898,1066.6622913617737,327.02467199082452,227.58129611889674,580.47303850167066,216,108,441,-111.02467199082452,-354,103,null,1963.6972468374033,1602.0556075438662,2310.8630753070347,1837.7484512489323,1540.7258479762429,2168.461171217059,1074,817,1398,-763.74845124893227,-1219,-290,"*↓",1631.6181434746018,1588,1910.1394121337589,2050.6600691044223,1725.0107642722992,2373.9535111846208,2814,2309,3296,763.33993089557771,103,1438,"*↑"]
["Yorkshire and the Humber","Calderdale",87.39142058609562,75.17537975501412,156.14959448839323,40.503630372323769,35.844161525558292,50.90186101998291,49,33,137,8.4963696276762306,-11,97,null,386.52521893616591,344.26952854632049,443.48962350804618,353.4547780182578,311.23503924264327,405.53640378923819,380,281,554,26.545221981742202,-80,209,null,569.08336047773844,514.29671076580144,650.84908926857042,644.04159160941845,584.5031669184649,723.93701843543897,923,749,1170,278.95840839058155,89,533,"*↑"]
["Yorkshire and the Humber","Doncaster",233.29333231945972,210.06438776062291,327.89211350822512,406.27910336707714,215.14491226360914,1395.7837213293014,102,40,242,-20,-1279,-78,"*↓",1101.1313007346164,1021.9834322406836,1204.3700919384078,846.49216962100184,368.99993010597171,967.61332603367146,800,571,1042,-264,-285,447,null,936.5753669459242,861.55526125241136,1042.4854608526025,897.22872701192102,416.19721247598005,1050.8453936711999,1214,935,1500,250,15,927,"*↑"]
["Yorkshire and the Humber","East Riding of Yorkshire",118.00802703907198,100.61873763147982,177.14727623699252,69.761626155252131,57.207051605840043,138.22270175891518,30,18,72,-39.761626155252131,-111,-4,"*↓",406.73996941853534,345.22242412024195,504.6871920497494,426.46980105670497,336.38582861732533,598.52697551403003,225,141,309,-201.46980105670497,-386,-75,"*↓",501.25200354239274,426.59151038278776,629.48721231719901,515.76857278804289,419.23282486332187,748.917931507341,604,487,742,88.231427211957111,-171,245]
["Yorkshire and the Humber","Kingston upon Hull, City of",230.76689454757275,212.59935339737171,259.88105113713726,251.69814498448861,216.8678769153214,313.02481722119671,97,73,142,-154.69814498448861,-220,-98,"*↓",1285.1861142701512,1185.7517524058678,1428.9374455205195,1214.1062046168372,1078.6953336970219,1352.2063640153276,749,619,912,-465.1062046168372,-655,-252,"*↓",1393.0469911822761,1298.8270859001993,1534.4353136360337,1456.4735597219044,1287.8326022707536,1605.7730454233674,2009,1731,2282,552.52644027809561,241,865,"*↑"]
["Yorkshire and the Humber","Kirklees",120.48387216764102,90.736781835673852,160.6409384482786,121.29525887321097,87.346383460953817,194.81531921273933,126,30,307,4.7047411267890311,-110,166,null,982.74020961188978,741.13545315936176,1209.4050215070797,938.64225371016062,659.19100932082188,1221.3437259798584,729,508,1106,-209.64225371016062,-571,258,null,1184.8547617833792,919.99758841466769,1475.027506158742,1200.6997324903678,888.71242227818516,1548.6729197877596,1483,1071,1877,282.30026750963225,-291,821]
["Yorkshire and the Humber","Leeds",546.36598630532546,395.09302471041462,815.22234055326669,330.48778449870673,252.88908905293312,475.32102667641021,300,91,736,-30.487784498706731,-270,370,null,1944.1335405010534,1513.6980771403635,2361.5720235261806,2115.2701646953988,1725.7256195344444,2541.0961853759027,1372,889,1930,-743.27016469539876,-1407,-30,"*↓",2153.9652317632631,1692.3524196502685,2607.983802009292,2452.4111116037625,2006.4674418857201,2911.1793173802316,3067,2342,3839,614.58888839623751,-371,1616]
["Yorkshire and the Humber","North East Lincolnshire",104.0560569205828,84.990814078609191,131.88599258458871,99.852235226086648,77.626150362055938,134.7478645756303,76,31,326,-23.852235226086648,-84,222,null,524.66543706057053,490,602.54129555318616,752.52411501153313,616.81106914148324,915.02738952824416,359,249,461,-393.52411501153313,-595,-229,"*↓",598.27850601884677,536.77582273008113,750.45800472997496,590.03318253728105,454.30351732680975,712.76705125182889,865,633,1019,274.96681746271895,28,486,"*↑"]
["Yorkshire and the Humber","North Lincolnshire",125.43947781238975,101.0615813446683,330.64440756586242,89.923757109849703,61.982332815940595,185.92290815068588,93,46,172,3.0762428901502972,-94,71,null,390.19525992290471,351,437.83204930895596,372.16851465003532,235.95465577613976,468.32353812056709,447,354,557,74.83148534996468,-76,258,null,431.36526226470551,390,489.61132618638169,622.77901854113725,485.08782190748883,798.81248920406324,626,510,744,3.2209814588627523,-223,202]
["Yorkshire and the Humber","North Yorkshire",116.92571705078444,106.01745903495488,140.27082871511524,96.543916081806316,66.251033497897495,152.81260553648553,92,56,192,-4.5439160818063158,-72,95,null,747.35903780996944,678.26646641330683,832.48434764796104,689.69294647693516,443.53870185746581,948.04427403022862,483,324,758,-206.69294647693516,-530,150,null,853.71524513924624,782.50682065179285,948.53932072807902,1053.7194324770107,703.39188570296119,1439.3551253656628,1223,914,1572,169.28056752298926,-336,660]
["Yorkshire and the Humber","Rotherham",177.2817076785212,140.81014350630267,349.71379629237862,135.6667785606015,106.52193250355641,289.21702959914649,65,47,144,-70.6667785606015,-220,13,null,719.4837752845923,626,896.77961980095176,701.61481515963692,615.73149178470032,864.410439691688,625,500,857,-76.614815159636919,-263,172,null,780.23451703688636,657.72717250229061,980.0765042138288,694.71840627976155,601.87468729236775,842.43677813179841,924,738,1145,229.28159372023845,-3,468]
["Yorkshire and the Humber","Sheffield",292.68573927472193,239.90373676728268,405.35597583365222,114,89,139,233,47,594,119,-50,454,null,1436.4562790531561,1284.1384960930329,1667.8722386812024,1078,844,1316,931,552,1385,-147,-611,394,null,2242.8579816721222,2014.6636117695025,2570.0501841457581,1812,1419,2213,2081,1541,2632,269,-547,1021]
["Yorkshire and the Humber","Wakefield",238.59126682218781,169.20992389414178,407.38932079395676,310.27277623060553,248.32475339284863,522.91281959816729,95,64,184,-215.27277623060553,-429,-124,"*↓",1077.8193125422106,940,1315.0768643918564,1220.0878039443376,1052.4861601683015,1448.5591752214707,831,710,979,-389.08780394433757,-660,-164,"*↓",1199.7705299351599,951.23316106364609,1521.9114379893419,938.63941982505719,800.64708850981754,1118.1310032975055,1417,1264,1616,478.36058017494281,237,717,"*↑"]
["Yorkshire and the Humber","York",84.451104381326559,67.913572708032589,322.50100737725234,52.225608233142353,45.082633842199385,145.16466238294544,61,40,163,5,-85,99,null,406.67093699173313,329,461.59957236517755,435.03294082269258,376.83899352210284,520.40924815872427,355,292,471,-6,-183,50,null,392.87795862694026,342,455.67066686245448,352.74145094416514,287.42780007346045,415.48863948652314,442,361,568,19,-10,236]
["East of England","East of England",2710.3207902883528,2456.5262481463187,3268.8076218350457,1887.7006386366779,1600.7535184852075,2305.6181781301152,1843,1252,2887,-44.700638636677922,-893,647,null,7442.9824473363051,6637.8201727601718,8265.8828482667359,6978.2645100337413,6319.8716108162989,7778.1523590492898,6075,5349,7204,-903.26451003374132,-1888,447,null,10432.307209090115,9268.1994261832551,11720.410491618,10397.227285196888,9340.1162495261578,11534.067590564424,13909,12256,15574,3511.7727148031117,1374,5615,"*↑"]
["East Midlands","East Midlands",2749.8687807956358,2379.3489932030757,3689.9934056710254,2525.6961433820975,2081.2080376661752,3214.5289317005854,1549,1115,2190,-976.69614338209749,-1802,-365,"*↓",9263.4737835374926,8500.3323948444649,9960.1872566747916,9583.7946865927097,8647.6651921944722,10384.627153913258,7454,6680,8747,-2129.7946865927097,-3214,-437,"*↓",8743.1419658738469,8045.8977795244809,9487.4992139592996,9355.6829067332292,8467.5939958992785,10163.642244676128,13160,11777,14644,3804.3170932667708,2193,5657,"*↑"]
["London","London",5999.7039626785008,5837.747206201786,7234.753649270785,5472.9476682825671,4902.0059805738529,6137.7284077191362,3653,3316,4932,-1819.9476682825671,-3158,-1213,"*↓",13400.565005344368,12797.626781676101,14109.580405195409,13859.321350231809,13192.241057291878,14768.134039594204,10986,10220,12114,-2873.3213502318085,-4119,-1537,"*↓",23187.723805316222,22151.425921978531,24154.310640555814,24585.550894255426,23411.097810841868,25642.995775423591,26111,24528,27467,1525.4491057445739,-408,3460]
["North East","North East",2237.3208145472049,2114.2491497291867,2904.5348993483476,1648.9249076312678,1417.5216831694058,2063.7420685090283,1152,929,1627,-496.92490763126784,-1151,-217,"*↓",8333.6079162517763,7842.9319379852823,8860.687954372077,7292.0766943768267,6820.8167931123808,7572.1286589225911,5945,5470,6667,-1347.0766943768267,-1828,-445,"*↓",5883.8716080854738,5568.5846437571181,6272.5779538829383,6335.124903672533,5997.2512682572205,6643.7407369514094,8317,7795,9146,1981.875096327467,1348,2902,"*↑"]
["North West","North West",3431.6931121749872,3427.3132527144585,4600.3295896931304,2437.4346607376119,2044.736266609922,3017.7072596972571,2042,1705,3246,-395.43466073761192,-1430,286,null,13089.122190983451,12374.129232210476,13851.783513800512,11903.444682209853,11126.797509330321,12743.988121543885,8495,7783,9559,-3408.4446822098525,-4543,-2082,"*↓",27184.200145196195,25677.000273358146,28449.489056462473,27731.761657754541,26025.142910414583,28984.361068469389,32110,30295,34027,4378.2383422454586,2089,7116,"*↑"]
["South East","South East",3857.5004682365379,3606.1614333346542,4644.4822804857167,3136.639710888935,2704.5793332753315,3645.1903558021295,2741,2033,3935,-395.63971088893504,-1336,556,null,11202.130656611951,10498.960849157625,11969.104149733696,9947.0983754206027,8980.8399677818907,10815.169302490171,9031,7593,10762,-916.09837542060268,-2710,1188,null,14201.328663582282,13315.266513353643,15229.8126477361,14984.01371415026,13589.575565096166,16189.512766373071,16867,15012,19522,1882.9862858497399,-427,5179]
["South West","South West",2273.0291344524917,2223.581224683513,2635.5138205009716,2198.3378144087865,1809.4740172755362,2829.1211732488605,1687,1375,2648,-511.33781440878647,-1273,356,null,9599.9543795893569,9133.3722255591583,10308.415173592441,8506.2523838926063,7904.1057037424998,9043.8249594098252,7112,6491,8166,-1394.2523838926063,-2175,-159,"*↓",12759.100709942848,12341.128571585066,13672.702041478638,12377.293439809793,11738.56976287225,13219.186764618049,14746,13811,16343,2368.7065601902068,1102,4097,"*↑"]
["West Midlands","West Midlands",3796.0834399516784,3538.0603886907047,4494.5243835053061,3110.778647947785,2614.4236048698949,3900.6602952480825,1945,1498,2886,-1165.778647947785,-2167,-426,"*↓",14456.719637732234,13580.135210730657,15391.116930843797,14183.549955008211,12998.978812736528,15119.460924192057,10915,10058,12213,-3268.5499550082113,-4617,-1361,"*↓",12792.979938131499,11974.179423468866,13651.804939260983,13412.034185053511,12441.94673245157,14396.533963906184,17410,16139,18953,3997.9658149464885,2434,5987,"*↑"]
["Yorkshire and the Humber","Yorkshire and the Humber",3222.8831747224422,3069.9255224463263,3981.9398080640217,2523.6508807702699,2065.0579890907356,3366.3381337287642,1725,1363,2616,-798.65088077026985,-1968,-221,"*↓",14098.826493545575,13323.794432953131,14866.629853184282,13695.983079660145,12798.46720662243,14436.692335056916,9946,9187,10984,-3749.9830796601454,-4865,-2303,"*↓",15442.9837071934,14749.494386223714,16337.909415653019,16092.120565220279,15026.443771006749,17094.098095376896,20550,19160,21879,4457.8794347797211,2571,6380,"*↑"]
["ENGLAND","ENGLAND",30278.40367784784,28819.209833028588,31979.991794839028,24942.111072686002,23474.506402830684,26487.979493432966,18337,17992,22522,-6605.1110726860024,-10257,-5442,"*↓",100887.38251093251,98739.13007530148,103212.83701305605,95949.785717426537,93351.575408805613,97923.457407544032,75959,74042,80381,-19990.785717426537,-22469,-14539,"*↓",130627.63775241187,127846.56216797084,133505.87105573516,135270.80955184644,131739.60576331886,137842.55682677441,163180,159605,168569,27909.19044815356,23585,34748,"*↑"]

{"sheet":"Opiate by Gender","index":11,"n_rows":166,"n_cols":16,"rows_kept":166,"cut":false,"hidden":false,"merged":[[5,7,6,7],[5,8,6,8],[5,9,6,9],[4,4,4,9],[5,4,6,4],[4,10,4,15],[5,10,6,10],[5,11,6,11],[5,12,6,12],[5,13,6,13],[5,14,6,14],[5,15,6,15],[5,5,6,5],[5,6,6,6],[5,1,6,1],[5,0,6,0],[5,3,6,3],[5,2,6,2]]}
["National and local opiate prevalence estimates by gender and rates per 1,000 population with 95% confidence intervals (CI) - 2014/15"]
[]
[]
[]
[null,null,null,null,"Number of users",null,null,null,null,null,"Rate per thousand of the population"]
["Region","Local authority","Male population\nAged 15-64","Female population\nAged 15-64","Female opiate users","Lower bound  95% CI","Upper bound  95% CI","Male opiate users","Lower bound  95% CI","Upper bound  95% CI","Female opiate users","Lower bound  95% CI","Upper bound  95% CI","Male opiate users","Lower bound  95% CI","Upper bound  95% CI"]
[]
["East Midlands","Derby",81863,81036,435,319,650,1554,1341,1825,5.3679845994372872,3.9365220395873441,8.0211264129522686,18.982934903436227,16.381026837521226,22.293343757252973]
["East Midlands","Derbyshire",246338,248271,755,511,1243,2726,1951,3525,3.041031775761164,2.0582347515416624,5.0066258242001682,11.066096176797734,7.9200123407675642,14.309607125169483]
["East Midlands","Leicester",114981,114769,368,317,626,1930,1515,2289,3.2064407636208383,2.7620698969233852,5.454434559855013,16.785381932667136,13.176089962689487,19.907636913924911]
["East Midlands","Leicestershire",213986,212909,382,311,981,1903,1135,2504,1.7941937635327769,1.4607179593159518,4.6076023089676807,8.8931051564121013,5.3040853139925037,11.70170011122223]
["East Midlands","Lincolnshire",221830,229866,697,503,1110,2232,1841,2746,3.032201369493531,2.1882314043834237,4.8289003158361821,10.061759004643196,8.2991479962133159,12.378848667898842]
["East Midlands","Northamptonshire",227572,230439,858,496,1204,2050,1512,2971,3.7233280824860375,2.1524134369616252,5.2248100364955583,9.0081380837712892,6.6440511134937514,13.05520890091927]
["East Midlands","Nottingham",114041,108260,536,351,773,1864,1583,2347,4.9510437834842049,3.242194716423425,7.1402179937188253,16.344998728527461,13.880972632649662,20.580317605071862]
["East Midlands","Nottinghamshire",253320,255089,1462,622,1389,2356,2356,4153,5.731332985742231,2.4383646492008673,5.4451583564951846,9.3004894994473393,9.3004894994473393,16.394283909679455]
["East Midlands","Rutland",12428,10881,14,7,57,41,10,91,1.2866464479367705,0.64332322396838526,5.2384891094568511,3.2990022529771483,0.80463469584808489,7.3221757322175733]
["East of England","Bedfordshire",138968,140348,391,260,649,1438,992,1858,2.7859321116082878,1.8525379770285291,4.6242197965058276,10.347705946692765,7.1383340049507797,13.369984456853375]
["East of England","Cambridgeshire",210780,205827,547,343,934,1407,1054,1920,2.6575716499778941,1.6664480364578018,4.5377914462145394,6.6752063763165381,5.0004744283138818,9.1090236265300319]
["East of England","Essex",443048,453773,1128,669,2110,3364,2032,4744,2.4858244100023583,1.4743054346556539,4.64990204353278,7.5928567559271229,4.586410501796645,10.707643415611853]
["East of England","Hertfordshire",367875,376302,701,402,1353,2717,2031,3591,1.8628654644407949,1.0682908940159765,3.5955163671731745,7.3856608902480456,5.5208970438328242,9.761467889908257]
["East of England","Luton",70712,68155,294,188,366,1117,941,1403,4.313696720710146,2.7584183112024063,5.3701122441493654,15.796470188935398,13.307500848512277,19.841045367122977]
["East of England","Norfolk",265643,268959,843,649,1424,2688,2139,3130,3.1343067158935005,2.4130071869690175,5.29448726385806,10.118843711296741,8.0521602300832313,11.782730958466814]
["East of England","Peterborough",62212,61280,332,232,457,1020,838,1207,5.4177545691905999,3.7859007832898173,7.4575718015665791,16.395550697614606,13.470070082942197,19.401401658843955]
["East of England","Southend-on-Sea",56052,56421,181,158,342,750,593,938,3.2080253806206911,2.8003757466191668,6.0615728186313609,13.380432455576964,10.57946192820952,16.734460857774923]
["East of England","Suffolk",225674,224962,479,333,982,1912,1192,2568,2.1292484953014288,1.4802499977774024,4.3651816751273556,8.4723982381665586,5.2819553869741309,11.379246169252992]
["East of England","Thurrock",53165,53834,67,48,237,451,289,645,1.2445666307537988,0.89162982501764687,4.4024222610246309,8.4830245462240192,5.4359070817267003,12.132041756794884]
["London","Barking and Dagenham",62279,65362,161,120,301,700,580,941,2.4632049202900768,1.835929133135461,4.605122242281448,11.239743733842868,9.3129305223269476,15.109426933637341]
["London","Barnet",122743,125524,226,144,548,1164,774,1578,1.8004525031069756,1.1471909754309932,4.3656989898346135,9.4832291861857705,6.3058585825668265,12.856130288488957]
["London","Bexley",74574,79190,104,59,254,437,287,728,1.3132971334764489,0.74504356610683165,3.2074756913751736,5.8599511894225875,3.8485262960281061,9.7621154826078786]
["London","Brent",113806,108400,227,154,470,1183,814,1503,2.0940959409594098,1.4206642066420665,4.3357933579335795,10.394882519375077,7.1525227140924033,13.206685060541623]
["London","Bromley",99157,105855,158,106,451,712,413,1047,1.4926078125738038,1.0013697983090077,4.2605450852581361,7.180531883780267,4.1651118932601836,10.559012475165646]
["London","Camden",85315,84095,522,322,602,1196,1018,1542,6.2072655924846902,3.8290029133717822,7.1585706641298534,14.018636816503546,11.932251069565728,18.074195627966947]
["London","City of London",3411,2544,6,4,15,17,8,26,2.3584905660377355,1.5723270440251573,5.8962264150943398,4.9838756962767521,2.3453532688361185,7.6223981237173852]
["London","Croydon",121446,128125,356,208,617,1130,887,1465,2.7785365853658539,1.6234146341463414,4.8156097560975608,9.3045468768012114,7.3036575926749334,12.062974490720157]
["London","Ealing",118409,115432,299,175,500,1730,1356,2120,2.5902695959525954,1.5160440778986763,4.3315545082819327,14.610375900480538,11.451832208700353,17.904044456080197]
["London","Enfield",103819,109870,345,158,599,1023,816,1637,3.1400746336579597,1.4380631655592975,5.4518976972786017,9.8536876679605854,7.859832978549206,15.767826698388539]
["London","Greenwich",93521,91306,246,152,433,865,593,1188,2.6942369614264123,1.6647317810439621,4.7422951394212864,9.2492595245987523,6.3408218474994928,12.703029266154125]
["London","Hackney",95748,96782,630,351,688,1359,1208,1767,6.5094749023578764,3.6267074455993882,7.1087598933686014,14.193507958390775,12.616451518569578,18.454693570622883]
["London","Hammersmith and Fulham",64500,66417,262,186,383,916,715,1125,3.9447731755424065,2.8004878269117848,5.7665959016516855,14.2015503875969,11.085271317829458,17.441860465116278]
["London","Haringey",97385,94856,466,220,506,940,789,1412,4.9127097916842368,2.3193050518680947,5.3344016192966182,9.6524105355034138,8.1018637367150994,14.499152846947682]
["London","Harrow",81507,80817,202,79,445,800,576,1303,2.4994741205439448,0.97751710654936463,5.50626724575275,9.8151079048425292,7.0668776914866207,15.986357000012267]
["London","Havering",76276,80006,150,78,380,596,396,965,1.874859385546084,0.9749268804839637,4.7496437767167459,7.813729089097488,5.1916723477896056,12.651423776810532]
["London","Hillingdon",98476,97096,292,167,458,1052,770,1397,3.0073329488341431,1.719947268682541,4.7169811320754711,10.682805962874202,7.8191640602786467,14.18619765221983]
["London","Hounslow",94059,89184,182,138,393,1098,769,1341,2.0407247936849662,1.5473627556512377,4.4066200215285258,11.673524064682805,8.175719495210453,14.257008898669984]
["London","Islington",84213,83795,598,322,607,1151,1062,1563,7.1364639894981803,3.8427113789605585,7.2438689659287547,13.667723510621876,12.61087955541306,18.560079797655945]
["London","Kensington and Chelsea",54831,55393,204,139,310,590,441,774,3.6827758019966423,2.5093423356741829,5.5963749932301914,10.760336306104213,8.0428954423592494,14.11610220495705]
["London","Kingston upon Thames",57592,58462,113,79,236,337,245,552,1.9328794772672846,1.3513051212753584,4.036810235708665,5.8515071537713572,4.2540630643144883,9.5846645367412133]
["London","Lambeth",121266,118592,562,294,693,1256,1033,1725,4.7389368591473291,2.4790879654614142,5.84356449001619,10.357396137416918,8.518463542955157,14.224927019939637]
["London","Lewisham",102079,104949,401,219,527,1085,841,1481,3.8209034864553257,2.0867278392362003,5.0214866268377971,10.629022619735695,8.2387170720716316,14.508370967583929]
["London","Merton",69022,70481,114,63,256,378,172,638,1.6174571870433168,0.89385791915551704,3.6321845603779743,5.4765147344325005,2.4919590855089679,9.243429631132102]
["London","Newham",123164,108192,336,209,544,1541,1186,1979,3.1055900621118009,1.9317509612540669,5.0280981958000597,12.511772920658634,9.6294371731999604,16.068006885128771]
["London","Redbridge",96860,97673,223,83,352,672,446,1041,2.2831283978172063,0.84977424672120239,3.6038618656128101,6.9378484410489367,4.6045839355771214,10.747470576089201]
["London","Richmond upon Thames",62384,65009,162,90,339,466,293,800,2.4919626513252013,1.3844236951806672,5.2146625851805135,7.4698640677096693,4.6967171069505005,12.823800974608874]
["London","Southwark",112397,112838,448,317,680,1343,1042,1715,3.9702936953863066,2.8093372799943284,6.0263386447827862,11.948717492459764,9.270710072332891,15.258414370490316]
["London","Sutton",63872,66336,166,87,334,570,393,849,2.5024119633381576,1.3115050651230102,5.0349734684032805,8.9240981963927855,6.1529308617234468,13.292209418837675]
["London","Tower Hamlets",111381,101111,395,274,583,1914,1551,2272,3.9065976995579121,2.7098930877946019,5.7659404021323102,17.184259433835216,13.925175748107847,20.398452159704078]
["London","Waltham Forest",93244,91891,288,135,513,1042,829,1364,3.1341480667312358,1.4691319062802668,5.5827012438650137,11.17498176826391,8.8906524816610197,14.628287074771567]
["London","Wandsworth",110754,120038,252,164,490,888,525,1256,2.0993352105166694,1.3662340258918009,4.0820406871157466,8.017769109919282,4.7402351156617373,11.340448200516461]
["London","Westminster",89728,80939,253,202,451,1250,965,1492,3.1258107957844796,2.4957066432745649,5.5720975055288546,13.930991440798859,10.754725392296718,16.628031383737518]
["North East","County Durham",165302,168174,566,405,720,1435,1272,1811,3.3655618585512621,2.4082200577972812,4.2812801027507223,8.681080688678902,7.6950067149822745,10.955705315120204]
["North East","Darlington",32408,33981,164,144,257,492,400,630,4.8262264206468322,4.2376622230069749,7.5630499396721698,15.181436682300667,12.342631449024932,19.439644532214267]
["North East","Gateshead",64549,65064,443,312,582,1172,1013,1401,6.8086806836345755,4.7952784950202876,8.9450387310955364,18.156749136315046,15.693504159630667,21.704441587011416]
["North East","Hartlepool",28983,29946,202,196,298,716,621,860,6.7454751886729447,6.545114539504441,9.9512455753689988,24.704136907842528,21.426353379567331,29.67256667701756]
["North East","Middlesbrough",44940,45532,440,369,535,1496,1327,1644,9.6635333391900193,8.1041904594570866,11.74997803742423,33.288829550511792,29.528259902091676,36.582109479305743]
["North East","Newcastle upon Tyne",103261,97900,446,329,639,1337,1047,1636,4.5556690500510726,3.3605720122574056,6.5270684371807963,12.947773118602377,10.13935561344554,15.84334840840201]
["North East","North Tyneside",63735,66661,230,174,464,704,532,1216,3.4502932749283688,2.610221868858853,6.9605916502902749,11.045736251667059,8.3470620538165843,19.078998980152193]
["North East","Northumberland",96316,99580,237,236,463,855,664,1090,2.3799959831291426,2.3699538059851379,4.649528017674232,8.8770297769840933,6.8939740022426186,11.316915154283816]
["North East","Redcar and Cleveland",40831,42879,218,171,328,735,616,983,5.0840737890342593,3.9879661372699919,7.6494321229506284,18.00102863020744,15.086576375792903,24.074845093188998]
["North East","South Tyneside",46994,48850,212,120,232,376,346,545,4.3398157625383824,2.4564994882292734,4.7492323439099282,8.0010214069881265,7.3626420394092866,11.597225177682256]
["North East","Stockton-on-Tees",61956,63494,354,289,527,1303,1109,1525,5.5753299524364506,4.5516111758591355,8.2999968500960719,21.031054296597585,17.899799857963714,24.614242365549746]
["North East","Sunderland",89220,91821,251,209,486,1030,708,1246,2.733579464392677,2.2761677611875277,5.2929068513738686,11.54449674960771,7.935440484196369,13.96547859224389]
["North West","Blackburn with Darwen",47432,46746,236,173,311,974,840,1154,5.0485603046249947,3.7008514097462881,6.6529756556710735,20.534660145049756,17.709563164108619,24.329566537358744]
["North West","Blackpool",44310,44010,446,364,539,1113,977,1263,10.134060440808907,8.2708475346512156,12.247216541695069,25.118483412322274,22.049198826450013,28.503723764387271]
["North West","Bolton",89281,89602,402,402,842,2144,1643,2433,4.4865069976116603,4.4865069976116603,9.3971116716144714,24.014067942787378,18.402571655783426,27.251038854851537]
["North West","Bury",58611,60425,115,115,243,620,482,724,1.9031857674803474,1.9031857674803474,4.0215142738932563,10.578219105628635,8.2237122724403271,12.352630052379247]
["North West","Cheshire",218030,223979,664,492,1177,2221,1511,2881,2.9645636421271639,2.1966345059135008,5.2549569379272167,10.186671558959775,6.930238957941568,13.21377792046966]
["North West","Cumbria",153781,154706,832,591,1263,1855,1475,2356,5.3779426783705864,3.8201491861983379,8.1638721187284276,12.062608514705978,9.5915620265182291,15.320488226764034]
["North West","Halton",39987,41722,147,112,304,500,339,842,3.5233210296725948,2.6844350702267388,7.286323762044006,12.504063820741742,8.4777552704629002,21.056843474129092]
["North West","Knowsley",45346,50173,248,174,344,701,566,858,4.9428975743926022,3.4680007175173899,6.8562772806090928,15.458915891148061,12.481806554051074,18.921183786883077]
["North West","Lancashire",373331,376001,1533,1145,2454,4357,3074,5389,4.0771168161786804,3.0452046670088646,6.5265783867596099,11.670608655589813,8.2339800338037836,14.434911646769221]
["North West","Liverpool",164968,163983,1241,982,1572,3353,2843,3919,7.5678576437801484,5.9884256294859837,9.5863595616618795,20.325153969254643,17.233645313030404,23.756122399495659]
["North West","Manchester",191280,181446,998,708,1293,2756,2241,3414,5.5002590302348908,3.9019873681425881,7.1260871002943018,14.408197406942701,11.715809284818068,17.848180677540778]
["North West","Oldham",71805,72613,220,168,449,1095,871,1530,3.0297605112032282,2.3136352994642833,6.1834657705920426,15.249634426571966,12.130074507346286,21.307708376853981]
["North West","Rochdale",67798,69358,371,259,489,1041,894,1318,5.3490585080307964,3.7342483923988583,7.0503763084287323,15.354435234077702,13.186229682291513,19.440101477919701]
["North West","Salford",82682,79053,249,182,412,958,720,1225,3.1497855868847484,2.3022529189278078,5.2116934208695431,11.586560557315982,8.7080622142667092,14.815800295106552]
["North West","Sefton",82487,86175,470,331,671,1145,1000,1607,5.4540179866550629,3.841021177835799,7.7864809979692486,13.880975183968383,12.123122431413435,19.481857747281392]
["North West","St. Helens",55828,56481,299,190,417,839,720,1063,5.2938156194118369,3.3639631026362848,7.383013756838583,15.028301210861933,12.896754316830265,19.040624776098014]
["North West","Stockport",88917,91014,292,185,492,951,731,1273,3.2082976245412795,2.0326543169182765,5.4057617509394156,10.695367589999663,8.2211500612931161,14.316722336561062]
["North West","Tameside",70625,71673,254,233,374,944,805,1077,3.5438728670489588,3.2508755040252253,5.2181435128988607,13.366371681415929,11.398230088495575,15.249557522123894]
["North West","Trafford",73605,74631,245,115,353,487,334,789,3.2828181318754943,1.5409146333293136,4.7299379614369359,6.6163983425039063,4.5377352082059641,10.719380476869778]
["North West","Warrington",67125,66368,167,150,314,635,471,762,2.5162729026036645,2.2601253616200578,4.7311957569913208,9.4599627560521409,7.016759776536313,11.351955307262569]
["North West","Wigan",103346,103170,394,323,681,1473,1096,1742,3.8189396142289422,3.1307550644567219,6.6007560337307352,14.253091556518878,10.605151626574807,16.85599829698295]
["North West","Wirral",96961,102108,686,530,882,1976,1670,2316,6.718376620832843,5.1905825204685234,8.6379127982136552,20.37932777095946,17.223419725456626,23.885892265962603]
["South East","Bracknell Forest",39651,39378,40,28,109,196,128,284,1.0157956219208695,0.71105693534460868,2.7680430697343694,4.9431287987692611,3.2281657461350282,7.162492749237094]
["South East","Brighton and Hove",101954,98728,760,344,1023,1338,1259,2677,7.6979175107365689,3.484320557491289,10.361802123004619,13.123565529552543,12.348706279302432,26.25693940404496]
["South East","Buckinghamshire",162764,165923,329,185,656,1065,577,1606,1.9828474653905728,1.1149750185326928,3.9536411467970085,6.5432159445577645,3.5450099530608732,9.8670467670983761]
["South East","East Sussex",157034,163480,474,344,841,1507,987,1981,2.8994372400293615,2.1042329336921948,5.1443601663812091,9.5966478596991731,6.2852630640498237,12.615102461887234]
["South East","Hampshire",415441,424321,765,486,1347,2063,1477,2864,1.8028803665149733,1.1453592916683362,3.1744834688832273,4.9658074191040367,3.5552581473662928,6.8938790345680854]
["South East","Isle of Wight",40726,41482,139,77,198,342,242,502,3.3508509715057135,1.8562267971650355,4.7731546212815203,8.3975838530668359,5.9421499779010949,12.326278053332024]
["South East","Kent",468114,477233,1050,633,2057,3351,1953,4947,2.2001831390536699,1.3263961209723554,4.3102635400318086,7.1585126699906434,4.1720606518924876,10.567938579064073]
["South East","Medway",90411,89884,256,181,481,952,731,1224,2.8481153486716213,2.0137065551154825,5.3513417293400378,10.529692183473252,8.0852993551669599,13.538175664465607]
["South East","Milton Keynes",85261,85970,202,130,372,644,391,925,2.3496568570431546,1.5121554030475748,4.3270908456438288,7.5532775829511731,4.585918532506069,10.849040006568067]
["South East","Oxfordshire",221257,217800,688,387,1244,2123,1634,3235,3.1588613406795227,1.7768595041322315,5.7116620752984391,9.5951766497783115,7.3850770823070002,14.621006341042316]
["South East","Portsmouth",73980,68956,349,219,496,966,724,1207,5.0611984453854628,3.1759382794825686,7.1929926329833522,13.05758313057583,9.7864287645309531,16.315220329818867]
["South East","Reading",56295,54298,275,197,473,882,713,1231,5.0646432649453015,3.628126266160816,8.7111864157059191,15.667466027178257,12.665423216981969,21.866950883737456]
["South East","Slough",48726,47732,139,113,256,619,445,746,2.9120925165507416,2.3673845638146318,5.363278303863237,12.7036900217543,9.1327012272708625,15.310101383245085]
["South East","Southampton",88914,82481,343,219,471,930,735,1257,4.158533480437919,2.6551569452358721,5.7104060329045474,10.459545178487078,8.2664147378365609,14.137256225116404]
["South East","Surrey",364488,370391,528,373,1208,1881,1247,2485,1.4255205985026635,1.0070439076543436,3.2614183389985181,5.1606637255547509,3.421237461864314,6.8177827527929589]
["South East","West Berkshire",49584,49756,109,76,241,379,258,500,2.19069056998151,1.5274539753999519,4.8436369483077417,7.6435947079703128,5.2032913843175219,10.083898031623104]
["South East","West Sussex",247711,256346,409,297,1077,1821,962,2635,1.5954998322579639,1.1585903427398907,4.2013528590264713,7.3513085813710326,3.8835578557270365,10.637395997755448]
["South East","Windsor and Maidenhead",46722,46522,75,57,200,373,265,613,1.6121404926701344,1.2252267744293022,4.2990413137870256,7.9833911219553961,5.6718462394589269,13.120157527503103]
["South East","Wokingham",50288,50831,50,38,158,227,123,399,0.98365170860301798,0.74757529853829363,3.1083393991855366,4.5139993636652882,2.4459115494750239,7.9342984409799548]
["South West","Bath and North East Somerset",59428,59661,158,139,427,826,566,1243,2.6482962069023319,2.329830207338127,7.1571043059955413,13.899172107424109,9.5241300397119204,20.916066500639431]
["South West","Bournemouth",66030,62134,351,341,624,1159,935,1339,5.6490810184440079,5.4881385392860595,10.042810699456014,17.552627593518096,14.16023019839467,20.278661214599424]
["South West","Bristol, City of",154781,150480,1059,780,1352,3057,2603,3534,7.0374800637958534,5.1834130781499201,8.9845826687931964,19.750486170783237,16.817309618105583,22.83225977348641]
["South West","Cornwall and Isles of Scilly",162257,169522,566,388,928,1527,1177,1995,3.3387996838168497,2.2887884758320456,5.4742157360106649,9.4109961357599357,7.2539243299210519,12.295309293281646]
["South West","Devon",228366,234345,609,381,956,1504,1158,1977,2.5987326377776356,1.62580810343724,4.0794555036377993,6.5859190947864388,5.070807388140091,8.6571556186122276]
["South West","Dorset",119635,121322,358,225,667,1031,795,1481,2.9508250770676381,1.8545688333525661,5.4977662748718288,8.6178793831236682,6.6452125214193165,12.379320432983658]
["South West","Gloucestershire",191924,193812,460,369,991,1958,1248,2457,2.3734340494912596,1.9039068788310323,5.1132024848822573,10.201954940497281,6.5025739355161418,12.801942435547405]
["South West","North Somerset",61505,63488,409,174,561,734,670,1529,6.442162298387097,2.7406754032258065,8.836315524193548,11.933989106576702,10.893423298918787,24.859767498577352]
["South West","Plymouth",87301,85491,680,445,783,1339,1247,1772,7.9540536430735393,5.2052262811290078,9.1588588272449734,15.337739544793301,14.283914273605113,20.297591092885533]
["South West","Poole",46214,46377,100,90,303,332,211,609,2.1562412402699613,1.9406171162429653,6.5334109580179831,7.1839702254728008,4.5657160167914483,13.177824901544986]
["South West","Somerset",162317,165829,421,330,701,1226,948,1572,2.5387598067889212,1.9900017487894157,4.2272461390950919,7.5531213612868644,5.8404233690864178,9.6847526753205138]
["South West","South Gloucestershire",88219,86668,232,152,439,656,403,927,2.6768818941247057,1.7538191720127383,5.0653066875894215,7.4360398553599563,4.5681769233385099,10.50794046633945]
["South West","Swindon",71978,70725,203,170,360,709,558,870,2.8702721809826794,2.4036762106751501,5.0901378579003183,9.850232015338019,7.7523687793492453,12.087026591458502]
["South West","Torbay",38589,40039,184,155,311,556,439,729,4.5955193686155997,3.8712255550837935,7.7674267589100623,14.408251056000415,11.376298945295291,18.891393920547308]
["South West","Wiltshire",150923,149687,316,198,631,825,565,1174,2.1110717697595649,1.3227601595328919,4.2154629326528017,5.4663636423871775,3.7436308581197033,7.7788011105000558]
["West Midlands","Birmingham",357546,362499,1784,1203,2469,6450,5285,7616,4.9213928866010663,3.3186298444961229,6.8110532718710948,18.039636857914786,14.781314851795294,21.300755706957986]
["West Midlands","Coventry",115158,110544,379,252,634,1426,1147,1781,3.4284990591981477,2.2796352583586623,5.7352728325372704,12.382986852845656,9.9602285555497652,15.465707983813543]
["West Midlands","Dudley",97840,98997,280,212,479,1315,1113,1546,2.8283685364202955,2.1414790347182238,4.8385304605190056,13.440310711365495,11.375715453802126,15.801308258381033]
["West Midlands","Herefordshire, County of",57420,56996,162,136,364,668,514,1014,2.8423047231384655,2.3861323601656257,6.3864130816197626,11.63357715081853,8.9515848136537777,17.659352142110762]
["West Midlands","Sandwell",101049,101462,484,253,558,1323,1136,1776,4.7702588161084938,2.4935443811476214,5.4995959078275609,13.0926580173975,11.242070678581678,17.575631624261497]
["West Midlands","Shropshire",96866,94054,282,177,432,829,695,1197,2.9982775852170032,1.8818976332745019,4.5931060879920045,8.5582144405673812,7.1748601160365864,12.357277063159417]
["West Midlands","Solihull",63429,65974,156,87,331,780,562,1094,2.3645678600660864,1.3187013065753175,5.0171279594991969,12.297214208012107,8.8603004934651342,17.247631209699037]
["West Midlands","Staffordshire",275025,270388,619,507,978,2060,1723,2483,2.2893027797091587,1.8750832137520896,3.6170244241608356,7.4902281610762662,6.2648850104535949,9.0282701572584312]
["West Midlands","Stoke-on-Trent",82188,79947,663,488,856,1847,1641,2254,8.292994108596945,6.1040439291030308,10.707093449410234,22.472867085219253,19.966418455248942,27.424928213364481]
["West Midlands","Telford and Wrekin",55165,54513,207,148,281,558,491,782,3.7972593693247481,2.71494872782639,5.1547337332379435,10.115109217801143,8.9005710142300369,14.175654853620955]
["West Midlands","Walsall",85265,86205,335,275,539,1292,1073,1491,3.8860854938808655,3.190070181543994,6.2525375558262279,15.152759045329269,12.584296018295902,17.486659238843608]
["West Midlands","Warwickshire",174530,173737,450,284,810,1635,1203,2119,2.5901218508435164,1.6346546791990193,4.6622193315183296,9.3680169598349856,6.8927977998051908,12.141179166905403]
["West Midlands","Wolverhampton",81432,81003,324,285,600,1580,1270,1795,3.999851857338617,3.5183882078441542,7.4071330691455879,19.402691816484921,15.595834561351802,22.042931525690147]
["West Midlands","Worcestershire",178506,180164,556,386,979,1826,1254,2282,3.0860771297262493,2.1424923958171442,5.4339379676294932,10.229348033119335,7.024973950455446,12.783884015103135]
["Yorkshire and the Humber","Barnsley",76246,76540,462,322,609,1072,930,1443,6.0360595766919261,4.2069506140580089,7.9566239874575384,14.059753954305799,12.197361173045143,18.925582981402304]
["Yorkshire and the Humber","Bradford",167839,168159,1118,698,1240,2986,2659,3767,6.6484696031731874,4.1508334374015066,7.3739734418021046,17.790859097110921,15.842563408981224,22.44412800362252]
["Yorkshire and the Humber","Calderdale",66308,66785,246,219,425,1106,895,1381,3.6834618552070073,3.2791794564647749,6.3637044246462526,16.67973698497919,13.497617180430717,20.827049526452313]
["Yorkshire and the Humber","Doncaster",98048,96438,563,420,751,1553,1257,1868,5.8379476969659265,4.3551297206495363,7.7873867147804807,15.83918080939948,12.82025130548303,19.051892950391643]
["Yorkshire and the Humber","East Riding of Yorkshire",102000,103162,198,147,361,661,496,853,1.9193113743432659,1.4249432930730308,3.499350536050096,6.4803921568627452,4.8627450980392153,8.3627450980392144]
["Yorkshire and the Humber","Kingston upon Hull, City of",88064,84846,589,502,792,2266,1935,2556,6.9419890153925934,5.9166018433396976,9.3345590835160177,25.731286337209301,21.97265625,29.024345930232556]
["Yorkshire and the Humber","Kirklees",139544,137707,505,342,724,1833,1468,2349,3.6672064600928054,2.4835338799044351,5.2575395586281015,13.135641804735425,10.519979361348392,16.833400217852432]
["Yorkshire and the Humber","Leeds",254728,258703,1034,771,1558,3705,2884,4572,3.9968612656211953,2.9802514852939472,6.0223499534214913,14.544926352815553,11.321880594202444,17.948556892057411]
["Yorkshire and the Humber","North East Lincolnshire",50062,50479,335,266,448,965,793,1112,6.6364230670179678,5.2695180173933718,8.8749777135046255,19.27609763892773,15.840357956134394,22.212456553873196]
["Yorkshire and the Humber","North Lincolnshire",53192,53249,271,208,382,895,721,1047,5.0892974515953355,3.90617664181487,7.1738436402561554,16.825838471950668,13.554669875169198,19.683411039254022]
["Yorkshire and the Humber","North Yorkshire",184854,183970,465,350,796,1333,1024,1732,2.5275860194596942,1.9024841006685873,4.3267924118062728,7.211096324667035,5.5395068540577972,9.3695565148711957]
["Yorkshire and the Humber","Rotherham",81783,82577,391,313,586,1223,1029,1466,4.7349746297395159,3.7904016856994081,7.0964069898397861,14.954208087255298,12.582076959759362,17.925485736644536]
["Yorkshire and the Humber","Sheffield",189268,186730,761,599,1201,2484,1868,3066,4.0754029882718363,3.2078401970759924,6.4317463717667218,13.124247099351184,9.8696028911384914,16.199251854513175]
["Yorkshire and the Humber","Wakefield",105715,107168,532,438,709,1811,1640,2113,4.9641684084801438,4.0870409077336518,6.6157808300985366,17.130965331315327,15.513408693184505,19.987702785791985]
["Yorkshire and the Humber","York",68537,69053,216,172,331,642,549,852,3.1280320912921957,2.4908403689919334,4.7934195473042447,9.3672031165647738,8.0102718239782895,12.431241519179421]
["East of England","East of England",1894129,1909861,4966,4242,6598,16861,14955,18716,2.6001892284307599,2.221104048933404,3.4547016772424799,8.9017168313245829,7.8954495707525725,9.8810587874426723]
["East Midlands","East Midlands",1486359,1491520,5519,4300,6159,16644,15742,19122,3.7002520918257886,2.8829650289637416,4.1293445612529505,11.197833094158275,10.59098104832009,12.864994257780253]
["London","London",2959218,2956560,9427,8217,10095,31323,30630,34049,3.1885028546689393,2.7792434450848282,3.4144411072327299,10.584891008367752,10.350707517999687,11.506080322571705]
["North East","North East",838495,853882,3795,3482,4382,11619,11079,12637,4.4444080095376179,4.0778468219262152,5.1318566265596415,13.856969928264331,13.212958932372882,15.071049916815246]
["North West","North West",2287536,2305437,10519,10027,12213,32128,30191,33952,4.5626924526673251,4.349283888477542,5.2974772244914954,14.044806289387358,13.198043659203615,14.842170789880464]
["South East","South East",2809321,2831512,6983,6054,8852,21656,19897,24811,2.4661735496794646,2.1380802906715566,3.1262449179095833,7.7086242547576447,7.0824943109028835,8.8316714252305104]
["South West","South West",1689467,1699580,6116,5710,7427,17429,16569,19249,3.5985361089210275,3.3596535614681273,4.3699031525435696,10.316271344749557,9.8072350628926159,11.393534173795642]
["West Midlands","West Midlands",1821419,1816483,6704,6071,7953,23566,22191,25621,3.6906483572926363,3.3421727591174815,4.3782408093001699,12.93826406774059,12.183358139999637,14.066505290655254]
["Yorkshire and the Humber","Yorkshire and the Humber",1726188,1725566,7686,6956,8548,24535,23466,26352,4.4541906829411335,4.0311410864609067,4.9537369187849087,14.213399699221638,13.594116052249234,15.266008105721973]
["ENGLAND","ENGLAND",17512132,17590401,61682,60229,66019,195794,193879,204188,3.5065715670722915,3.4239696980188232,3.7531264921135112,11.18047762545417,11.071124863608841,11.659802472937047]