{"text_format":"1","workbook":"xlsx","n_sheets":5,"sheets":["Front sheet","Charts","Rates","RAW","Lookup"],"not_rendered":{"charts":4,"images":8,"macros":1,"external_links":0,"defined_names":2,"comments":0,"pivot_tables":0},"unopened":[],"bounds":{"document_bytes":16777216,"sheet_cells":100000,"rows_first":2000,"rows_last":500,"rows_between":2000,"halvings":0,"cell_chars":16384,"cell_head_chars":4096},"cells_cut":0,"cells_raw":0,"read":"whole","date_system":"1900"}

{"sheet":"Front sheet","index":0,"n_rows":29,"n_cols":1,"rows_kept":29,"cut":false,"hidden":false,"merged":[[20,0,22,6],[0,0,1,6],[2,0,2,6],[4,0,6,6],[8,0,13,6],[15,0,19,6]]}
["Births and deaths"]
[]
["1981 - 2016"]
[]
["The data used in this publication comes the annual Office for National Statistics (ONS) registered births and deaths in England and Wales data releases."]
[]
[]
[]
["Chart breakdowns are available for the 12 Lancashire county authorities and the two neighbouring unitary authorities of Blackburn with Darwen and Blackpool.  As well total summary figures for the combined 14 authorities (Lancashire-14) and the combined Lancashire county districts (Lancashire-12)."]
[]
[]
[]
[]
[]
[]
["The trend line chart shows the total registered births and deaths between 1981 and 2016, as well as a  the difference between the two (Deaths-births).  Users should note that is not an accurate depiction of population change over time. As it excludes inward and outward migration.  "]
[]
[]
[]
[]
["The column chart also shows the total registered births and deaths between 1981 and 2016, but does not include the difference calculation."]
[]
[]
[]
[]
["Source : ONS annual births and deaths registrations, last published July 2017"]
[]
["Deaths registered in England and Wales"]
["Births registered in England and Wales"]

{"sheet":"Charts","index":1,"n_rows":48,"n_cols":6,"rows_kept":48,"cut":false,"hidden":false,"merged":[[3,4,4,6],[0,0,1,26]]}
[{"$f":"\"Births and deaths 1981 - 2016 \" & \" : \" & B8","v":"Births and deaths 1981 - 2016  : Lancashire-14"}]
[]
[]
[null,null,null,null,"<< Select area "]
[]
[]
[]
[null,"Lancashire-14",null,"Total live births","Total registered deaths","Difference"]
[null,null,null,"live births","deaths","difference"]
[null,null,1981,{"$f":"SUM(IF(RAW!$A$2:$A$73=Charts!$C10,IF(RAW!$B$2:$B$73=Charts!$D$9,IF(RAW!$C$1:$R$1=Charts!$B$8,RAW!$C$2:$R$73))))","v":17597},{"$f":"SUM(IF(RAW!$A$2:$A$73=Charts!$C10,IF(RAW!$B$2:$B$73=Charts!$E$9,IF(RAW!$C$1:$R$1=Charts!$B$8,RAW!$C$2:$R$73))))","v":18959},{"$f":"D10-E10","v":-1362}]
[null,null,1982,{"$f":"SUM(IF(RAW!$A$2:$A$73=Charts!$C11,IF(RAW!$B$2:$B$73=Charts!$D$9,IF(RAW!$C$1:$R$1=Charts!$B$8,RAW!$C$2:$R$73))))","v":17583},{"$f":"SUM(IF(RAW!$A$2:$A$73=Charts!$C11,IF(RAW!$B$2:$B$73=Charts!$E$9,IF(RAW!$C$1:$R$1=Charts!$B$8,RAW!$C$2:$R$73))))","v":19275},-1692]
[null,null,1983,{"$f":"SUM(IF(RAW!$A$2:$A$73=Charts!$C12,IF(RAW!$B$2:$B$73=Charts!$D$9,IF(RAW!$C$1:$R$1=Charts!$B$8,RAW!$C$2:$R$73))))","v":17829},{"$f":"SUM(IF(RAW!$A$2:$A$73=Charts!$C12,IF(RAW!$B$2:$B$73=Charts!$E$9,IF(RAW!$C$1:$R$1=Charts!$B$8,RAW!$C$2:$R$73))))","v":19086},-1257]
[null,null,1984,{"$f":"SUM(IF(RAW!$A$2:$A$73=Charts!$C13,IF(RAW!$B$2:$B$73=Charts!$D$9,IF(RAW!$C$1:$R$1=Charts!$B$8,RAW!$C$2:$R$73))))","v":18021},{"$f":"SUM(IF(RAW!$A$2:$A$73=Charts!$C13,IF(RAW!$B$2:$B$73=Charts!$E$9,IF(RAW!$C$1:$R$1=Charts!$B$8,RAW!$C$2:$R$73))))","v":18508},-487]
[null,null,1985,{"$f":"SUM(IF(RAW!$A$2:$A$73=Charts!$C14,IF(RAW!$B$2:$B$73=Charts!$D$9,IF(RAW!$C$1:$R$1=Charts!$B$8,RAW!$C$2:$R$73))))","v":18308},{"$f":"SUM(IF(RAW!$A$2:$A$73=Charts!$C14,IF(RAW!$B$2:$B$73=Charts!$E$9,IF(RAW!$C$1:$R$1=Charts!$B$8,RAW!$C$2:$R$73))))","v":19357},-1049]
[null,null,1986,{"$f":"SUM(IF(RAW!$A$2:$A$73=Charts!$C15,IF(RAW!$B$2:$B$73=Charts!$D$9,IF(RAW!$C$1:$R$1=Charts!$B$8,RAW!$C$2:$R$73))))","v":18547},{"$f":"SUM(IF(RAW!$A$2:$A$73=Charts!$C15,IF(RAW!$B$2:$B$73=Charts!$E$9,IF(RAW!$C$1:$R$1=Charts!$B$8,RAW!$C$2:$R$73))))","v":18691},-144]
[null,null,1987,{"$f":"SUM(IF(RAW!$A$2:$A$73=Charts!$C16,IF(RAW!$B$2:$B$73=Charts!$D$9,IF(RAW!$C$1:$R$1=Charts!$B$8,RAW!$C$2:$R$73))))","v":18964},{"$f":"SUM(IF(RAW!$A$2:$A$73=Charts!$C16,IF(RAW!$B$2:$B$73=Charts!$E$9,IF(RAW!$C$1:$R$1=Charts!$B$8,RAW!$C$2:$R$73))))","v":18188},776]
[null,null,1988,{"$f":"SUM(IF(RAW!$A$2:$A$73=Charts!$C17,IF(RAW!$B$2:$B$73=Charts!$D$9,IF(RAW!$C$1:$R$1=Charts!$B$8,RAW!$C$2:$R$73))))","v":19183},{"$f":"SUM(IF(RAW!$A$2:$A$73=Charts!$C17,IF(RAW!$B$2:$B$73=Charts!$E$9,IF(RAW!$C$1:$R$1=Charts!$B$8,RAW!$C$2:$R$73))))","v":18229},954]
[null,null,1989,{"$f":"SUM(IF(RAW!$A$2:$A$73=Charts!$C18,IF(RAW!$B$2:$B$73=Charts!$D$9,IF(RAW!$C$1:$R$1=Charts!$B$8,RAW!$C$2:$R$73))))","v":19107},{"$f":"SUM(IF(RAW!$A$2:$A$73=Charts!$C18,IF(RAW!$B$2:$B$73=Charts!$E$9,IF(RAW!$C$1:$R$1=Charts!$B$8,RAW!$C$2:$R$73))))","v":18302},805]
[null,null,1990,{"$f":"SUM(IF(RAW!$A$2:$A$73=Charts!$C19,IF(RAW!$B$2:$B$73=Charts!$D$9,IF(RAW!$C$1:$R$1=Charts!$B$8,RAW!$C$2:$R$73))))","v":19795},{"$f":"SUM(IF(RAW!$A$2:$A$73=Charts!$C19,IF(RAW!$B$2:$B$73=Charts!$E$9,IF(RAW!$C$1:$R$1=Charts!$B$8,RAW!$C$2:$R$73))))","v":17924},1871]
[null,null,1991,{"$f":"SUM(IF(RAW!$A$2:$A$73=Charts!$C20,IF(RAW!$B$2:$B$73=Charts!$D$9,IF(RAW!$C$1:$R$1=Charts!$B$8,RAW!$C$2:$R$73))))","v":19647},{"$f":"SUM(IF(RAW!$A$2:$A$73=Charts!$C20,IF(RAW!$B$2:$B$73=Charts!$E$9,IF(RAW!$C$1:$R$1=Charts!$B$8,RAW!$C$2:$R$73))))","v":17909},1738]
[null,null,1992,{"$f":"SUM(IF(RAW!$A$2:$A$73=Charts!$C21,IF(RAW!$B$2:$B$73=Charts!$D$9,IF(RAW!$C$1:$R$1=Charts!$B$8,RAW!$C$2:$R$73))))","v":18642},{"$f":"SUM(IF(RAW!$A$2:$A$73=Charts!$C21,IF(RAW!$B$2:$B$73=Charts!$E$9,IF(RAW!$C$1:$R$1=Charts!$B$8,RAW!$C$2:$R$73))))","v":17380},1262]
[null,null,1993,{"$f":"SUM(IF(RAW!$A$2:$A$73=Charts!$C22,IF(RAW!$B$2:$B$73=Charts!$D$9,IF(RAW!$C$1:$R$1=Charts!$B$8,RAW!$C$2:$R$73))))","v":18413},{"$f":"SUM(IF(RAW!$A$2:$A$73=Charts!$C22,IF(RAW!$B$2:$B$73=Charts!$E$9,IF(RAW!$C$1:$R$1=Charts!$B$8,RAW!$C$2:$R$73))))","v":18174},239]
[null,null,1994,{"$f":"SUM(IF(RAW!$A$2:$A$73=Charts!$C23,IF(RAW!$B$2:$B$73=Charts!$D$9,IF(RAW!$C$1:$R$1=Charts!$B$8,RAW!$C$2:$R$73))))","v":17749},{"$f":"SUM(IF(RAW!$A$2:$A$73=Charts!$C23,IF(RAW!$B$2:$B$73=Charts!$E$9,IF(RAW!$C$1:$R$1=Charts!$B$8,RAW!$C$2:$R$73))))","v":17153},596]
[null,null,1995,{"$f":"SUM(IF(RAW!$A$2:$A$73=Charts!$C24,IF(RAW!$B$2:$B$73=Charts!$D$9,IF(RAW!$C$1:$R$1=Charts!$B$8,RAW!$C$2:$R$73))))","v":17260},{"$f":"SUM(IF(RAW!$A$2:$A$73=Charts!$C24,IF(RAW!$B$2:$B$73=Charts!$E$9,IF(RAW!$C$1:$R$1=Charts!$B$8,RAW!$C$2:$R$73))))","v":17382},-122]
[null,null,1996,{"$f":"SUM(IF(RAW!$A$2:$A$73=Charts!$C25,IF(RAW!$B$2:$B$73=Charts!$D$9,IF(RAW!$C$1:$R$1=Charts!$B$8,RAW!$C$2:$R$73))))","v":17424},{"$f":"SUM(IF(RAW!$A$2:$A$73=Charts!$C25,IF(RAW!$B$2:$B$73=Charts!$E$9,IF(RAW!$C$1:$R$1=Charts!$B$8,RAW!$C$2:$R$73))))","v":17074},350]
[null,null,1997,{"$f":"SUM(IF(RAW!$A$2:$A$73=Charts!$C26,IF(RAW!$B$2:$B$73=Charts!$D$9,IF(RAW!$C$1:$R$1=Charts!$B$8,RAW!$C$2:$R$73))))","v":16894},{"$f":"SUM(IF(RAW!$A$2:$A$73=Charts!$C26,IF(RAW!$B$2:$B$73=Charts!$E$9,IF(RAW!$C$1:$R$1=Charts!$B$8,RAW!$C$2:$R$73))))","v":17391},-497]
[null,null,1998,{"$f":"SUM(IF(RAW!$A$2:$A$73=Charts!$C27,IF(RAW!$B$2:$B$73=Charts!$D$9,IF(RAW!$C$1:$R$1=Charts!$B$8,RAW!$C$2:$R$73))))","v":16685},{"$f":"SUM(IF(RAW!$A$2:$A$73=Charts!$C27,IF(RAW!$B$2:$B$73=Charts!$E$9,IF(RAW!$C$1:$R$1=Charts!$B$8,RAW!$C$2:$R$73))))","v":16795},-110]
[null,null,1999,{"$f":"SUM(IF(RAW!$A$2:$A$73=Charts!$C28,IF(RAW!$B$2:$B$73=Charts!$D$9,IF(RAW!$C$1:$R$1=Charts!$B$8,RAW!$C$2:$R$73))))","v":16226},{"$f":"SUM(IF(RAW!$A$2:$A$73=Charts!$C28,IF(RAW!$B$2:$B$73=Charts!$E$9,IF(RAW!$C$1:$R$1=Charts!$B$8,RAW!$C$2:$R$73))))","v":16878},{"$f":"D28-E28","v":-652}]
[null,null,2000,{"$f":"SUM(IF(RAW!$A$2:$A$73=Charts!$C29,IF(RAW!$B$2:$B$73=Charts!$D$9,IF(RAW!$C$1:$R$1=Charts!$B$8,RAW!$C$2:$R$73))))","v":15749},{"$f":"SUM(IF(RAW!$A$2:$A$73=Charts!$C29,IF(RAW!$B$2:$B$73=Charts!$E$9,IF(RAW!$C$1:$R$1=Charts!$B$8,RAW!$C$2:$R$73))))","v":16195},{"$f":"D29-E29","v":-446}]
[null,null,2001,{"$f":"SUM(IF(RAW!$A$2:$A$73=Charts!$C30,IF(RAW!$B$2:$B$73=Charts!$D$9,IF(RAW!$C$1:$R$1=Charts!$B$8,RAW!$C$2:$R$73))))","v":15644},{"$f":"SUM(IF(RAW!$A$2:$A$73=Charts!$C30,IF(RAW!$B$2:$B$73=Charts!$E$9,IF(RAW!$C$1:$R$1=Charts!$B$8,RAW!$C$2:$R$73))))","v":16126},-482]
[null,null,2002,{"$f":"SUM(IF(RAW!$A$2:$A$73=Charts!$C31,IF(RAW!$B$2:$B$73=Charts!$D$9,IF(RAW!$C$1:$R$1=Charts!$B$8,RAW!$C$2:$R$73))))","v":15229},{"$f":"SUM(IF(RAW!$A$2:$A$73=Charts!$C31,IF(RAW!$B$2:$B$73=Charts!$E$9,IF(RAW!$C$1:$R$1=Charts!$B$8,RAW!$C$2:$R$73))))","v":16229},-1000]
[null,null,2003,{"$f":"SUM(IF(RAW!$A$2:$A$73=Charts!$C32,IF(RAW!$B$2:$B$73=Charts!$D$9,IF(RAW!$C$1:$R$1=Charts!$B$8,RAW!$C$2:$R$73))))","v":16155},{"$f":"SUM(IF(RAW!$A$2:$A$73=Charts!$C32,IF(RAW!$B$2:$B$73=Charts!$E$9,IF(RAW!$C$1:$R$1=Charts!$B$8,RAW!$C$2:$R$73))))","v":16347},-192]
[null,null,2004,{"$f":"SUM(IF(RAW!$A$2:$A$73=Charts!$C33,IF(RAW!$B$2:$B$73=Charts!$D$9,IF(RAW!$C$1:$R$1=Charts!$B$8,RAW!$C$2:$R$73))))","v":16952},{"$f":"SUM(IF(RAW!$A$2:$A$73=Charts!$C33,IF(RAW!$B$2:$B$73=Charts!$E$9,IF(RAW!$C$1:$R$1=Charts!$B$8,RAW!$C$2:$R$73))))","v":15497},1455]
[null,null,2005,{"$f":"SUM(IF(RAW!$A$2:$A$73=Charts!$C34,IF(RAW!$B$2:$B$73=Charts!$D$9,IF(RAW!$C$1:$R$1=Charts!$B$8,RAW!$C$2:$R$73))))","v":17017},{"$f":"SUM(IF(RAW!$A$2:$A$73=Charts!$C34,IF(RAW!$B$2:$B$73=Charts!$E$9,IF(RAW!$C$1:$R$1=Charts!$B$8,RAW!$C$2:$R$73))))","v":15672},1345]
[null,null,2006,{"$f":"SUM(IF(RAW!$A$2:$A$73=Charts!$C35,IF(RAW!$B$2:$B$73=Charts!$D$9,IF(RAW!$C$1:$R$1=Charts!$B$8,RAW!$C$2:$R$73))))","v":17219},{"$f":"SUM(IF(RAW!$A$2:$A$73=Charts!$C35,IF(RAW!$B$2:$B$73=Charts!$E$9,IF(RAW!$C$1:$R$1=Charts!$B$8,RAW!$C$2:$R$73))))","v":15104},2115]
[null,null,2007,{"$f":"SUM(IF(RAW!$A$2:$A$73=Charts!$C36,IF(RAW!$B$2:$B$73=Charts!$D$9,IF(RAW!$C$1:$R$1=Charts!$B$8,RAW!$C$2:$R$73))))","v":17535},{"$f":"SUM(IF(RAW!$A$2:$A$73=Charts!$C36,IF(RAW!$B$2:$B$73=Charts!$E$9,IF(RAW!$C$1:$R$1=Charts!$B$8,RAW!$C$2:$R$73))))","v":15367},2168]
[null,null,2008,{"$f":"SUM(IF(RAW!$A$2:$A$73=Charts!$C37,IF(RAW!$B$2:$B$73=Charts!$D$9,IF(RAW!$C$1:$R$1=Charts!$B$8,RAW!$C$2:$R$73))))","v":18085},{"$f":"SUM(IF(RAW!$A$2:$A$73=Charts!$C37,IF(RAW!$B$2:$B$73=Charts!$E$9,IF(RAW!$C$1:$R$1=Charts!$B$8,RAW!$C$2:$R$73))))","v":15483},2602]
[null,null,2009,{"$f":"SUM(IF(RAW!$A$2:$A$73=Charts!$C38,IF(RAW!$B$2:$B$73=Charts!$D$9,IF(RAW!$C$1:$R$1=Charts!$B$8,RAW!$C$2:$R$73))))","v":17868},{"$f":"SUM(IF(RAW!$A$2:$A$73=Charts!$C38,IF(RAW!$B$2:$B$73=Charts!$E$9,IF(RAW!$C$1:$R$1=Charts!$B$8,RAW!$C$2:$R$73))))","v":15001},2867]
[null,null,2010,{"$f":"SUM(IF(RAW!$A$2:$A$73=Charts!$C39,IF(RAW!$B$2:$B$73=Charts!$D$9,IF(RAW!$C$1:$R$1=Charts!$B$8,RAW!$C$2:$R$73))))","v":17870},{"$f":"SUM(IF(RAW!$A$2:$A$73=Charts!$C39,IF(RAW!$B$2:$B$73=Charts!$E$9,IF(RAW!$C$1:$R$1=Charts!$B$8,RAW!$C$2:$R$73))))","v":14623},3247]
[null,null,2011,{"$f":"SUM(IF(RAW!$A$2:$A$73=Charts!$C40,IF(RAW!$B$2:$B$73=Charts!$D$9,IF(RAW!$C$1:$R$1=Charts!$B$8,RAW!$C$2:$R$73))))","v":17873},{"$f":"SUM(IF(RAW!$A$2:$A$73=Charts!$C40,IF(RAW!$B$2:$B$73=Charts!$E$9,IF(RAW!$C$1:$R$1=Charts!$B$8,RAW!$C$2:$R$73))))","v":14683},3190]
{"$rows_left_out":9}
{"sheet":"Rates","index":2,"n_rows":57,"n_cols":25,"rows_kept":57,"cut":false,"hidden":false,"merged":[[52,0,52,11],[54,0,54,11],[55,0,55,12],[56,0,56,12],[30,0,31,1],[30,23,30,25],[0,0,1,27],[4,0,5,1],[4,12,5,12],[26,0,26,11],[30,2,30,6],[30,13,30,17],[30,7,30,12],[4,2,4,6],[4,7,4,11]]}
["Births and deaths rates 2012 - 2016"]
[]
[]
[]
["Area of usual residence",null,"Total number of deaths",null,null,null,null,"Standardised mortality ratios (SMR)",null,null,null,null,"Direction"]
[null,null,2016,2015,2014,2013,2012,2016,2015,2014,2013,2012,null,"England"]
["E92000001           ","ENGLAND",490791,495309,468875,473552,466779,99,99,99,99,99,{"$f":"IF(H7>L7,\"p\",IF(H7<L7,\"q\",\"n\"))","v":"n"},99]
["E12000002           ","NORTH WEST",71315,71299,68318,69045,68262,111,110,111,110,110,{"$f":"IF(H8>L8,\"p\",IF(H8<L8,\"q\",\"n\"))","v":"p"},99]
["E06000008           ","Blackburn with Darwen",1349,1265,1234,1215,1225,133,120,119,124,121,"p",99]
["E06000009           ","Blackpool",1862,1986,1782,1816,1822,141,128,128,129,139,"p",99]
["E10000017           ","Lancashire-12",12333,12259,12004,12126,11903,106,104,108,108,107,"q",99]
["E07000117           ","Burnley",865,943,911,914,1000,113,121,123,121,133,"q",99]
["E07000118           ","Chorley",1087,1024,1044,986,980,108,102,110,104,105,"p",99]
["E07000119           ","Fylde",1055,1056,1019,1044,1015,102,101,103,104,103,"q",99]
["E07000120           ","Hyndburn",845,799,812,843,787,122,115,123,125,117,"p",99]
["E07000121           ","Lancaster",1530,1497,1481,1519,1458,111,107,111,111,108,"p",99]
["E07000122           ","Pendle",835,858,873,846,819,105,107,114,108,106,"q",99]
["E07000123           ","Preston",1177,1239,1205,1212,1222,111,115,117,115,116,"q",99]
["E07000124           ","Ribble Valley",611,550,608,552,550,93,84,99,89,92,"p",99]
["E07000125           ","Rossendale",621,670,650,646,611,105,112,115,113,108,"q",99]
["E07000126           ","South Ribble",1021,1006,939,989,965,94,93,92,97,96,"q",99]
["E07000127           ","West Lancashire",1210,1165,1075,1164,1036,106,102,101,109,99,"p",99]
["E07000128           ","Wyre",1476,1452,1387,1411,1460,102,100,101,102,107,"q",99]
[]
[null,"Significantly above England"]
[null,"Significantly below England"]
["The \"Direction\" column simply indicates whether or not the latest figures, represent an increase or decrease upon the 2012 figures. "]
[]
["1 SMRs are based on the latest mid-year population estimates at the time of publication. For more information on these rates please see the ONS guide to mortality statistics."]
[]
["Area of usual residence",null,"Total number of births",null,null,null,null,"General fertility rate (GFR) ",null,null,null,null,null," Total fertility rate (TFR) ",null,null,null,null,null,null,null,null,null,"<< Select area"]
[null,null,2016,2015,2014,2013,2012,2016,2015,2014,2013,2012,"Direction",2016,2015,2014,2013,2012,"Direction","Wyre",{"$f":"SUM(IF(TFR=$T$32,IF($N$32:$R$32=U33,$N$33:$R$49)))","v":1.83},{"$f":"SUM(IF(TFR=$T$32,IF($N$32:$R$32=V33,$N$33:$R$49)))","v":1.79},{"$f":"SUM(IF(TFR=$T$32,IF($N$32:$R$32=W33,$N$33:$R$49)))","v":1.88},{"$f":"SUM(IF(TFR=$T$32,IF($N$32:$R$32=X33,$N$33:$R$49)))","v":1.81},{"$f":"SUM(IF(TFR=$T$32,IF($N$32:$R$32=Y33,$N$33:$R$49)))","v":1.79}]
["E92000001           ","ENGLAND",663157,664399,661496,664517,694241,62.5,62.5,62.2,62.4,64.900000000000006,{"$f":"IF(H33>L33,\"p\",IF(H33<L33,\"q\",\"n\"))","v":"q"},1.81,1.82,1.83,1.85,1.94,{"$f":"IF(N33>R33,\"p\",IF(N33<R33,\"q\",\"n\"))","v":"q"},null,2012,2013,2014,2015,2016]
["E12000002           ","NORTH WEST",86069,85838,85606,86372,89211,63.4,62.9,62.5,62.6,64.099999999999994,{"$f":"IF(H34>L34,\"p\",IF(H34<L34,\"q\",\"n\"))","v":"q"},1.85,1.85,1.86,1.88,1.94,{"$f":"IF(N34>R34,\"p\",IF(N34<R34,\"q\",\"n\"))","v":"q"},"Replacement fertility",2.1,2.1,2.1,2.1,2.1]
["E06000008           ","Blackburn with Darwen",2156,2115,2212,2254,2300,75.7,73.2,75.8,75.599999999999994,75.907590759075916,"q",2.25,2.1800000000000002,2.25,2.25,2.2599999999999998,"q","England",{"$f":"R33","v":1.94},{"$f":"Q33","v":1.85},{"$f":"P33","v":1.83},{"$f":"O33","v":1.82},{"$f":"N33","v":1.81}]
["E06000009           ","Blackpool",1700,1665,1819,1717,1770,70.599999999999994,67.8,72.5,66.900000000000006,68.242279369240848,"p",2.09,2.0299999999999998,2.17,2.0299999999999998,2.09,"n",{"$f":"T32","v":"Wyre"},1.83,1.79,1.88,1.81,1.79]
["E10000017           ","Lancashire-12",13183,13202,13210,13317,13681,61.7,61.2,60.9,60.7,61.833910347383551,"q",1.85,1.85,1.86,1.87,1.93,"q"]
["E07000117           ","Burnley",1207,1197,1122,1210,1227,75.3,73.599999999999994,68,72.7,72.93586161802294,"p",2.19,2.13,1.98,2.14,2.17,"p"]
["E07000118           ","Chorley",1226,1269,1231,1182,1229,61.5,63.2,61.2,58.8,61.465366341585401,"p",1.83,1.91,1.88,1.83,1.93,"q"]
["E07000119           ","Fylde",629,633,600,645,682,57.3,57.4,53.1,56.3,58.395410565973116,"q",1.79,1.82,1.67,1.78,1.88,"q"]
{"$rows_left_out":18}
{"sheet":"RAW","index":3,"n_rows":73,"n_cols":18,"rows_kept":73,"cut":false,"hidden":true,"merged":[]}
["Year","BorD","Lancashire-14","Lancashire-12","Blackburn with Darwen","Blackpool","Burnley","Chorley","Fylde","Hyndburn","Lancaster","Pendle","Preston","Ribble Valley","Rossendale","South Ribble","West Lancashire","Wyre"]
[1981,"live births",17597,13839,2317,1441,1300,1220,634,1118,1376,1269,1729,520,949,1231,1469,1024]
[1982,"live births",17583,13759,2361,1463,1286,1225,654,1109,1443,1232,1691,514,918,1292,1414,981]
[1983,"live births",17829,14030,2258,1541,1362,1209,676,1115,1447,1280,1773,504,881,1347,1494,942]
[1984,"live births",18021,14191,2318,1512,1336,1166,648,1126,1546,1255,1807,532,890,1386,1460,1039]
[1985,"live births",18308,14352,2341,1615,1374,1203,696,1150,1534,1294,1836,517,913,1335,1490,1010]
[1986,"live births",18547,14425,2303,1819,1442,1205,729,1095,1565,1292,1805,541,905,1326,1467,1053]
[1987,"live births",18964,14688,2374,1902,1342,1283,725,1151,1567,1287,1908,558,903,1406,1469,1089]
[1988,"live births",19183,14899,2337,1947,1410,1285,768,1170,1600,1285,1926,609,968,1375,1393,1110]
[1989,"live births",19107,15037,2266,1804,1450,1317,775,1165,1558,1244,2009,593,968,1362,1426,1170]
[1990,"live births",19795,15442,2398,1955,1449,1384,738,1186,1548,1310,2139,578,973,1498,1496,1143]
[1991,"live births",19647,15324,2372,1951,1478,1323,729,1244,1625,1301,2029,536,991,1385,1494,1189]
[1992,"live births",18642,14510,2329,1803,1413,1217,722,1206,1541,1252,1936,516,961,1290,1349,1107]
[1993,"live births",18413,14213,2404,1796,1334,1222,720,1208,1515,1197,1897,558,946,1249,1338,1029]
[1994,"live births",17749,13637,2286,1826,1239,1149,679,1185,1429,1202,1862,502,892,1184,1312,1002]
[1995,"live births",17260,13215,2362,1683,1195,1183,704,1233,1397,1114,1684,463,874,1142,1245,981]
[1996,"live births",17424,13391,2263,1770,1227,1138,663,1174,1481,1137,1835,527,791,1129,1228,1061]
[1997,"live births",16894,12980,2192,1722,1132,1068,693,1045,1437,1095,1843,530,774,1120,1222,1021]
[1998,"live births",16685,12856,2204,1625,1168,1108,665,1068,1376,1130,1679,530,788,1142,1199,1003]
[1999,"live births",16226,12577,2121,1528,1132,1074,669,1046,1366,1077,1688,514,793,1078,1218,922]
[2000,"live births",15749,12132,2094,1523,1009,1041,592,1052,1338,1131,1593,546,757,1039,1073,961]
[2001,"live births",15644,12164,2083,1397,1056,1012,636,1019,1274,1083,1659,503,764,1118,1122,918]
[2002,"live births",15229,11716,2110,1403,1040,1035,573,1017,1216,1065,1562,484,715,1053,1067,889]
[2003,"live births",16155,12463,2143,1549,1092,1104,567,1132,1321,1114,1691,510,706,1100,1142,984]
[2004,"live births",16952,13082,2184,1686,1153,1241,600,1104,1328,1163,1758,522,817,1197,1179,1020]
[2005,"live births",17017,13084,2284,1649,1163,1177,655,1123,1401,1244,1801,475,803,1114,1193,935]
[2006,"live births",17219,13249,2315,1655,1173,1205,578,1119,1379,1224,1895,488,839,1186,1136,1027]
[2007,"live births",17535,13503,2338,1694,1273,1209,630,1088,1455,1266,1849,531,796,1178,1257,971]
[2008,"live births",18085,13963,2377,1745,1315,1238,642,1159,1487,1322,1943,505,876,1255,1244,977]
[2009,"live births",17868,13829,2312,1727,1213,1202,621,1231,1476,1345,1976,517,865,1236,1169,978]
[2010,"live births",17870,13797,2296,1777,1245,1193,679,1140,1518,1358,1992,478,849,1208,1198,939]
[2011,"live births",17873,13794,2344,1735,1172,1283,693,1164,1574,1303,1918,438,859,1285,1116,989]
[2012,"live births",17751,13681,2300,1770,1227,1229,682,1121,1584,1305,1857,475,835,1242,1168,956]
[2013,"live births",17288,13317,2254,1717,1210,1182,645,1135,1482,1278,1918,427,818,1138,1142,942]
[2014,"live births",17241,13210,2212,1819,1122,1231,600,1085,1497,1304,1869,457,837,1206,1011,991]
[2015,"live births",16982,13202,2115,1665,1197,1269,633,1077,1447,1261,1879,426,763,1208,1076,966]
[2016,"live births",17039,13183,2156,1700,1207,1226,629,1057,1456,1214,1893,482,818,1241,1000,960]
[1981,"deaths",18959,14458,1818,2683,1380,959,1106,1097,2026,1238,1657,649,802,949,1088,1507]
[1982,"deaths",19275,14654,1925,2696,1347,953,1200,1136,2019,1170,1650,644,840,988,1132,1575]
[1983,"deaths",19086,14577,1966,2543,1321,980,1257,1043,1923,1205,1696,705,804,940,1138,1565]
{"$rows_left_out":34}
{"sheet":"Lookup","index":4,"n_rows":17,"n_cols":2,"rows_kept":17,"cut":false,"hidden":true,"merged":[]}
[]
[null,"Lancashire-12"]
[null,"Lancashire-14"]
[null,"Blackburn with Darwen"]
[null,"Blackpool"]
[null,"Burnley"]
[null,"Chorley"]
[null,"Fylde"]
[null,"Hyndburn"]
[null,"Lancaster"]
[null,"Pendle"]
[null,"Preston"]
[null,"Ribble Valley"]
[null,"Rossendale"]
[null,"South Ribble"]
[null,"West Lancashire"]
[null,"Wyre"]